*HEADING
 Transfer from Explicit to Standard to Explicit
 - Adding/removing elements and verification for initial conditions
 - Test for S4R element
*RESTART,TIMEMARKS=NO,WRITE,NUMBER=2
*NODE, NSET=N1
*NCOPY , OLDSET=N1, NEWSET=N2, SHIFT, CHANGE=10
*ELEMENT, TYPE=S4R, ELSET=E1
*ELEMENT, TYPE=S4R, ELSET=E2
*SECTION CONTROL, NAME=SECT, HOURGLASS=RELAX STIFFNESS
*SHELL SECTION, ELSET=E1, MATERIAL=MAT, CONTROL=SECT
 0.002,
*SHELL SECTION, ELSET=E2, MATERIAL=MAT1, CONTROL=SECT
 0.002,
*MATERIAL, NAME=MAT
*HYPERELASTIC
3.2E6,0.8E6,0.001
*DENSITY
1000.,
*MATERIAL, NAME=MAT1
*HYPERELASTIC
3.2E6,0.8E6,0.001
*DENSITY
1000.,
*BOUNDARY
N1,3,6
N2,3,6
 1,1,2
11,1,2
 2,2,2
12,2,2
 4,1,1
14,1,1
*NSET, NSET=SIDE_1
**
*ELSET,ELSET=QA_TEST_ALLELEMS
E1, E2
**
*NSET, NSET=QA_TEST_ALLNODES
N1, 10, SIDE_1
**
*STEP
*DYNAMIC,EXPLICIT
 , 0.1
*BOUNDARY, TYPE=VELOCITY
 SIDE_1,1,1,2
***OUTPUT,HISTORY,TIME INTERVAL=0.0
***NODE OUTPUT,NSET=SIDE_1
**U,V,A
***ELEMENT OUTPUT,ELSET=E1
**S,
***ELEMENT OUTPUT,ELSET=E2
**S,
***ENERGY OUTPUT
**ALLKE,ALLSE,ALLWK,ALLIE,ETOTAL
*FILE OUTPUT,TIMEMARKS=YES, NUM=1
*EL FILE
 S,LE
 PEEQ,PE
*NODE FILE
 U,
 COORD,
*OUTPUT, FIELD, TIMEMARKS=YES, NUMBER INTERVAL=1
*ELEMENT OUTPUT, ELSET=QA_TEST_ALLELEMS
 S,LE
 PEEQ,PE
*NODE OUTPUT, NSET=QA_TEST_ALLNODES
 U,
 COORD,
*OUTPUT,FIELD,VARIABLE=PRESELECT
*OUTPUT,HISTORY,VARIABLE=PRESELECT,TIMEINT=0.1
*END STEP