*HEADING
 Transfer from Explicit to Standard : Test for S4R element
 - Springback analysis
 - tension test
*IMPORT,STEP=1,INT=2,UPDATE=YES,STATE=NO
 SHELL,
*MATERIAL,NAME=STEEL
*ELASTIC
 200.E9, 0.3
*DENSITY
 1000.,
*BOUNDARY
 1, 3,3
 2, 3,3
 3, 3,3
 4, 3,3
 1, 1,2
 2, 2,2
 3, 1,1
*RESTART, WRITE, FREQ=100
**
*STEP,NLGEOM,INC=50
*STATIC
 0.1, 1.
*CONTROLS,PARAMETERS=FIELD,FIELD=GLOBAL
 1.0E-4,,,1.
*PRINT,FREQ=1
*EL PRINT,FREQ=10
 S,
 E,
 STH,
 PEEQ,
*NODE PRINT,FREQ=10
 U,
 COORD,
 RF,
*END STEP