*HEADING
 Transfer from Explicit to Standard : Test for S4R element
 - Springback analysis
 - bending test
*IMPORT,STEP=1,INT=2,UPDATE=YES,STATE=NO
 SHELL,
*IMPORT NSET
 ALL,
*MATERIAL,NAME=STEEL
*ELASTIC
 200.E9, 0.3
*DENSITY
 1000.,
*BOUNDARY
 1, 1,6
 2, 1,6
 3, 1,1
 3, 5,6
 4, 1,1
 4, 5,6
*RESTART, WRITE, FREQ=100
**
*STEP,NLGEOM,INC=50
*STATIC
 0.01, 1.
*CONTROLS, PARAMETERS=FIELD, FIELD=DISPLACEMENT
 1.e-4,,,1.,
*PRINT,FREQ=1
*EL PRINT,FREQ=10
 S,
 E,
 STH,
 PEEQ,
*NODE PRINT,FREQ=10
 U,
 COORD,
 RF,
*OUTPUT,FIELD
*ELEMENT OUTPUT
S,
EE,
PE,
STH,
*NODE OUTPUT
COORD,
*END STEP