*HEADING
 Transfer from Explict to Standard: Test for *SHEAR FAILURE
 Results imported from: sx_x_cpe4r_n_y.inp
*IMPORT,STEP=2,INT=1,UPDATE=NO,STATE=YES
 EALL,
*nset,nset=all,gen
*MATERIAL,NAME=RHA
*ELASTIC
 207.8E9, .3
*PLASTIC
 1220.E6, 0.
 2440.E6, 1.
*FILE FORMAT, ZERO INC
*RESTART,WRITE
**
*STEP,NLGEOM
*STATIC
0.1,1.
*BOUNDARY
 ALL, 1,2
*EL FILE
E, S
*NODE FILE
COORD,
*OUTPUT,HISTORY,VARIABLE=PRESELECT
*OUTPUT,FIELD
*NODE OUTPUT
 COORD,
*ELEMENT OUTPUT
S,LE,PE,PEEQ
*END STEP