*HEADING
 NONSTRUCTURAL MASS VERIFICATION - SINGLE ELEMENT DECKS WITH "MASS PER VOLUME"
 UNITS.
 KEYWORD-PARAMETER COMBINATION TESTED: *PRINT,DMASS=YES
*RESTART,WRITE
*PREPRINT, MODEL=YES
*********************
*****S3R*******
*NODE,NSET=ALL-NODES
*NSET,NSET=DISPLACEMENT
*NSET,NSET=ROTATE-Y
*NSET,NSET=FIXED-NODES
*ELEMENT,TYPE=S3R,ELSET=REFERENCE3
*ELEMENT,TYPE=S3R,ELSET=TEST3
*ELSET,ELSET=NOSCALE-ELEMENTS
REFERENCE3,
*ELSET,ELSET=SCALE-ELEMENTS
TEST3,
***NODAL THICKNESS
**2001, .2
**2002, .2
**2003, .4
**2004, .4
**2101, .2
**2102, .2
**2103, .4
**2104, .4
*SHELL SECTION,
ELSET=REFERENCE3,MATERIAL=NOSCALE-MATERIAL
.5,
*SHELL SECTION,
ELSET=TEST3,MATERIAL=SCALE-MATERIAL
.5,
*****************************
*****S4R*********
*NODE,NSET=ALL-NODES
*NSET,NSET=DISPLACEMENT
*NSET,NSET=ROTATE-Y
*NSET,NSET=FIXED-NODES
*ELEMENT,TYPE=S4R,ELSET=REFERENCE4
*ELEMENT,TYPE=S4R,ELSET=TEST4
*ELSET,ELSET=NOSCALE-ELEMENTS
REFERENCE4,
*ELSET,ELSET=SCALE-ELEMENTS
TEST4,
*SHELL SECTION,ELSET=REFERENCE4,MATERIAL=NOSCALE-MATERIAL
.5,
*SHELL SECTION,ELSET=TEST4,MATERIAL=SCALE-MATERIAL
.5,
*************************
*******SAX1 ****
***NODE,NSET=ALL-NODES
**4001,   10.0, 5.
**4002,   12.0, 5.
**4101, 10.0, 0.
**4102, 12.0, 0.
***NSET,NSET=DISPLACEMENT
**4002, 4102
***NSET,NSET=ROTATE-Z
**4002, 4102
***NSET,NSET=FIXED-NODES
**4001,4101
***ELEMENT,TYPE=SAX1,ELSET=REFERENCE5
**4001, 4001,4002
***ELEMENT,TYPE=SAX1,ELSET=TEST5
**4101, 4101,4102
***ELSET,ELSET=NOSCALE-ELEMENTS
**REFERENCE5,
***ELSET,ELSET=SCALE-ELEMENTS
**TEST5,
***SHELL SECTION,ELSET=REFERENCE5,MATERIAL=NOSCALE-MATERIAL
**.5,
***SHELL SECTION,ELSET=TEST5,MATERIAL=SCALE-MATERIAL
**.5,
***********************************
*******SAX1 **
***NODE,NSET=ALL-NODES
**5001,   10.0, 15.
**5002,   12.0, 15.
**5101, 10.0, 10.
**5102, 12.0, 10.
***NSET,NSET=DISPLACEMENT
**5002, 5102
***NSET,NSET=ROTATE-Z
**5002, 5102
***NSET,NSET=FIXED-NODES
**5001,5101
***ELEMENT,TYPE=SAX1,ELSET=REFERENCE6
**5001, 5001,5002
***ELEMENT,TYPE=SAX1,ELSET=TEST6
**5101, 5101,5102
***ELSET,ELSET=NOSCALE-ELEMENTS
**REFERENCE6,
***ELSET,ELSET=SCALE-ELEMENTS
**TEST6,
*****NODAL THICKNESS
****5001, .2
****5002, .4
****5101, .2
****5102, .4
***SHELL SECTION,
**ELSET=REFERENCE6,MATERIAL=NOSCALE-MATERIAL
**.5,
***SHELL SECTION,
**ELSET=TEST6,MATERIAL=SCALE-MATERIAL
**.5,
********************************
** REMAINDER OF DECK SAME FOR ALL TESTS
******************************
*MATERIAL,NAME=NOSCALE-MATERIAL
*ELASTIC
1.E6, .25
*DENSITY
1.E-4,
*MATERIAL,NAME=SCALE-MATERIAL
*ELASTIC
1.E6, .25
*DENSITY
1.E-7,
*BOUNDARY
FIXED-NODES,1,6
**************************
*AMPLITUDE,NAME=SMOOTH,DEFINITION=SMOOTH STEP
0.,0.,  .00015, 1.
**************************
*NSET,NSET=QA_TEST
FIXED-NODES,
*ELSET,ELSET=QA_TEST
SCALE-ELEMENTS,
NOSCALE-ELEMENTS,
*NONSTRUCTURAL MASS, UNITS=MASS PER AREA, ELSET=SCALE-ELEMENTS
*STEP
*DYNAMIC,EXPLICIT
,.00015
*BOUNDARY,AMP=SMOOTH
DISPLACEMENT, 2,2, .05
ROTATE-Y, 5,5, .05
**ROTATE-Z, 6,6, .05
*RESTART,WRITE,NUMBER INTERVAL= 20
**********************
*FILE OUTPUT,NUMBER INTERVAL=4,TIMEMARKS=YES
*NODE FILE, NSET=FIXED-NODES
RF,
** RF not expected to be noisy.
*EL FILE
EMSF, EDT
** EMSF, EDT not expected to be noisy.
***********************
*OUTPUT, FIELD,NUMBER INTERVAL=1
*ELEMENT OUTPUT, ELSET=QA_TEST
EMSF, EDT
*NODE OUTPUT,NSET=QA_TEST
RF,
*****
***OUTPUT,HISTORY,TIME INTERVAL=0.
***NODE OUTPUT,NSET=FIXED-NODES
**RF,
***ELEMENT OUTPUT, ELSET=SCALE-ELEMENTS
**EDT,
***ELEMENT OUTPUT, ELSET=NOSCALE-ELEMENTS
**EDT,
*OUTPUT,HISTORY,VARIABLE=PRESELECT,TIMEINT=3.75E-05
*PRINT,DMASS=YES
*END STEP