*HEADING
 -  TEST ORIENTATION FOR SHELLS
SYSTEM-RECTANGULAR AND DEFINITION=NODES
*RESTART,WRITE
*SYSTEM
*NODE,NSET=NALL
*NSET, NSET=ORIGIN
*NSET, NSET=ALONGY
*TRANSFORM,NSET=NALL
*ELEMENT, TYPE=S4R, ELSET=ORIENT
*ORIENTATION,NAME=LOCAL,SYSTEM=RECTANGULAR,DEFINITION=NODES
*SHELL SECTION, ELSET=ORIENT, MATERIAL=MAT1,ORIENTATION=LOCAL
1.0,
*MATERIAL,NAME=MAT1
*ELASTIC
30.E6,0.3
**
*STEP,NLGEOM, UNSYMM=YES
*STATIC
.5, 1.0
*CLOAD
12, 1, 1000.0
13, 1, 1000.0
*BOUNDARY
ORIGIN, 1, 2
ALONGY, 1, 1
NALL, 3, 5
*EL FILE,FREQ=100
S,
SP,
E,
EP,
*END STEP