*NODE, NSET=C3D8R
*ELEMENT, TYPE=C3D8R, ELSET=C3D8R
*SOLID SECTION, ELSET=C3D8R, MATERIAL=POLY, CONTROLS=HOURGLASS
*NODE, NSET=CPE4R
*ELEMENT, TYPE=CPE4R, ELSET=CPE4R
*SOLID SECTION, ELSET=CPE4R, MATERIAL=POLY, CONTROLS=HOURGLASS
*NODE, NSET=CPS4R
*ELEMENT, TYPE=CPS4R, ELSET=CPS4R
*SOLID SECTION, ELSET=CPS4R, MATERIAL=POLY, CONTROLS=HOURGLASS
*NODE, NSET=S4R
*ELEMENT, TYPE=S4R, ELSET=S4R
*SHELL SECTION, ELSET=S4R, MATERIAL=POLY, CONTROLS=HOURGLASS
1.0, 3
*NODE, NSET=M3D4R
*ELEMENT, TYPE=M3D4R, ELSET=M3D4R
*MEMBRANE SECTION, ELSET=M3D4R, MATERIAL=POLY, CONTROLS=HOURGLASS
1.0,
***NODE, NSET=B31
**51, 30, 20
**52, 30, 30.
***ELEMENT, TYPE=B31, ELSET=B31
**51,51,52
***BEAM SECTION, SECTION=RECT, MATERIAL=POLY, ELSET=B31, CONTROLS=HOURGLASS
**10, 10.
*NODE, NSET=CAX4R
*ELEMENT, TYPE=CAX4R, ELSET=CAX4R
*SOLID SECTION, ELSET=CAX4R, MATERIAL=POLY, CONTROLS=HOURGLASS
*NODE, NSET=SAX1
*ELEMENT, TYPE=SAX1, ELSET=SAX1
*SHELL SECTION, ELSET=SAX1, MATERIAL=POLY, CONTROLS=HOURGLASS
1.0,
*NODE, NSET=T3D2
*ELEMENT, TYPE=T3D2, ELSET=T3D2
*SOLID SECTION, ELSET=T3D2, MATERIAL=POLY, CONTROLS=HOURGLASS
1.0,
*SECTION CONTROLS, NAME=HOURGLASS, HOURGLASS=STIFFNESS
*MATERIAL,NAME=POLY
*DENSITY
1.0,
*HYPERELASTIC,N=1,MODULI=INSTANTANEOUS
550.53,-275.265, 7e-7
*VISCOELASTIC,TIME=PRONY
0.1986, 0.,0.281e-7
0.1828, 0.,0.281e-5
0.1388, 0.,0.281e-3
0.2499, 0.,0.281e-1
0.1703, 0.,0.281e1
0.0593, 0.,0.281e3
*NSET, NSET=BOTTOM
*NSET, NSET=TOP
*BOUNDARY
BOTTOM,1,6
TOP,2,6
*BOUNDARY
1,1,3
2,2,3
3,3,3
4,1,1
4,3,3
5,1,2
6,2,2
8,1,1
**51,1,2
**52,1,1
S4R,3,6
M3D4R,3,3
**B31,3,6
SAX1,3,6
*AMPLITUDE, NAME=RELAXATION, TIME=TOTAL TIME, DEFINITION=SMOOTH STEP
0., 0., 2.0, 2.0, 20.0, 2.0
*STEP, NLGEOM
*VISCO, CETOL=0.05
0.25,5.,0.1,5.
*BOUNDARY, AMPLITUDE=RELAXATION
3,2,2,1.0
4,2,2,1.0
7,2,2,1.0
8,2,2,1.0
13,2,2,1.0
14,2,2,1.0
23,2,2,1.0
24,2,2,1.0
**52,2,2,1.0
TOP,1,1,1.0
*RESTART, WRITE, FREQ=1
*NSET, NSET=QA_TEST_NSET
C3D8R,CPE4R,CPS4R,S4R,M3D4R,CAX4R,SAX1,T3D2
*ELSET, ELSET=QA_TEST_ELSET
C3D8R,CPE4R,CPS4R,S4R,M3D4R,CAX4R,SAX1,T3D2
*OUTPUT, FIELD
*NODE OUTPUT
U,V,RF
*ELEMENT OUTPUT
S,LE
*OUTPUT, HISTORY
*ELEMENT OUTPUT, ELSET=QA_TEST_ELSET
S,LE
*ENERGY OUTPUT
ALLAE,ALLWK,ALLKE,ALLIE,ALLSE,ALLCD,ALLVD,ETOTAL
*ENERGY OUTPUT, ELSET=C3D8R
ALLAE,ALLKE,ALLIE,ALLSE,ALLCD,ALLVD
*ENERGY OUTPUT, ELSET=CPE4R
ALLAE,ALLKE,ALLIE,ALLSE,ALLCD,ALLVD
*ENERGY OUTPUT, ELSET=CPS4R
ALLAE,ALLKE,ALLIE,ALLSE,ALLCD,ALLVD
*ENERGY OUTPUT, ELSET=S4R
ALLAE,ALLKE,ALLIE,ALLSE,ALLCD,ALLVD
*ENERGY OUTPUT, ELSET=M3D4R
ALLAE,ALLKE,ALLIE,ALLSE,ALLCD,ALLVD
*ENERGY OUTPUT, ELSET=CAX4R
ALLAE,ALLKE,ALLIE,ALLSE,ALLCD,ALLVD
*ENERGY OUTPUT, ELSET=SAX1
ALLAE,ALLKE,ALLIE,ALLSE,ALLCD,ALLVD
*ENERGY OUTPUT, ELSET=T3D2
ALLAE,ALLKE,ALLIE,ALLSE,ALLCD,ALLVD
*END STEP
*STEP, NLGEOM
*VISCO, CETOL=0.05
1.,15.,1.,5.
*BOUNDARY, AMPLITUDE=RELAXATION
3,2,2,1.0
4,2,2,1.0
7,2,2,1.0
8,2,2,1.0
13,2,2,1.0
14,2,2,1.0
23,2,2,1.0
24,2,2,1.0
**52,2,2,1.0
TOP,1,1,1.0
*RESTART, WRITE, FREQ=1
*END STEP