*HEADING
 Test import capability:
 CROSS SECTION FOR CIRCULAR DISK
 M3D4R elements
 Base for file: sx_s_m3d4r_sst.inp
*RESTART,WRITE
*NODE
*NGEN,NSET=NSIDE10
*NGEN,NSET=NSIDE20
*nset,nset=nside1,gen
*nset,nset=nside2,gen
*NSET,NSET=NTIRE
 NSIDE1, NSIDE2
*NSET,NSET=NRIM
*NSET,NSET=NTREAD
*node,nset=rim_node
***ELEMENT,TYPE=CAX4H,ELSET=ETIRE
*ELEMENT,TYPE=CAX4R,ELSET=ETIRE
*ELGEN,ELSET=ETIRE
*ELSET,ELSET=ERIM
*ELSET,ELSET=ETREAD
*element,type=rax2,elset=rig_rim
*element,type=max1,elset=memb
*rigid body,elset=rig_rim,ref node=301
*SOLID SECTION,MATERIAL=HYPER,ELSET=ETIRE
*membrane section,elset=memb,material=hyper
0.01,
*MATERIAL,NAME=HYPER
***HYPERELASTIC
** 80.0, 20.0
*elastic
600.0,0.49
*DENSITY
 0.036,
*****
*STEP,INC=100,NLGEOM
 DO NOTHING
*STATIC
*BOUNDARY
 NTIRE, 2
 rim_node,1,6
*NODE PRINT,FREQ=0
*EL PRINT,FREQ=0
*NODE FILE,NSET=NRIM
 U, RF
*ELFILE,ELSET=ETREAD
 S,
*OUTPUT,FIELD,VARIABLE=PRESELECT,FREQUENCY=9999
*OUTPUT,FIELD
*NODE OUTPUT,NSET=NRIM
 U, RF
*OUTPUT,HISTORY
*NODE OUTPUT,NSET=NRIM
 U, RF
*OUTPUT,FIELD
*ELEMENT OUTPUT,ELSET=ETREAD
 S,
*OUTPUT,HISTORY
*ELEMENT OUTPUT,ELSET=ETREAD
 S,
*END STEP