** SUBSTRUCTURE GENERATION FILE FOR substrframe_rotz201_2modes.inp
*NODE
*NGEN
*ELEMENT,TYPE=B31,ELSET=BEAM
*ELGEN,ELSET=BEAM
*BEAM SECTION,SECTION=RECT,MATERIAL=STEEL,ELSET=BEAM
0.1 , 0.1
0, -1.
3,3
*MATERIAL,NAME=STEEL
*ELASTIC
2.1E11 , 0.3
*DENSITY
7200.,
**
**
*STEP
*FREQUENCY, EIGENSOLVER=LANCZOS
2,
*BOUNDARY
1 ,1,6
11,1,6
*EL PRINT,FREQUENCY=0
*END STEP
**
**
*STEP
*SUBSTRUCTURE GENERATE,TYPE=Z201,MASS MATRIX=YES,OVERWRITE
*RETAINED NODAL DOFS
*RETAINED EIGENMODES
*SUBSTRUCTURE LOAD CASE, NAME=SNOW
*DLOAD
BEAM,PZ , 1.
*END STEP