*HEADING
/Explicit [C3D8R] submodeling from:
***
submodel3delem_c3d10m_g_xpl or
submodel3delem_c3d4_g_xpl or
submodel3delem_c3d6_g_xpl or
submodel3delem_c3d8r_g_xpl
*********
*NODE,NSET=NALL
*NSET,NSET=NLOADED
*NSET,NSET=QA_TEST
NLOADED,
*NSET,NSET=NL
*SUBMODEL, ABSOLUTE EXT=0.0005
NL,
*ELEMENT,TYPE=C3D8R,ELSET=EALL
*ELSET,ELSET=EF
*SOLID SECTION,ELSET=EALL,MATERIAL=MAT1
*MATERIAL,NAME=MAT1
*DENSITY
10.0
*ELASTIC
30.E6,0.3
*AMPLITUDE,NAME=RAMP,DEF=SMOOTH STEP
0,0,0.04,1
*************************
*STEP
*DYNAMIC,EXPLICIT
 ,0.04
*BOUNDARY,SUBMODEL,STEP=1
NL,1,3
*ELSET,ELSET=LOAD
*DLOAD,OP=NEW,AMP=RAMP
LOAD,P4,-1.E6
***************
*FILE OUTPUT,NUMBER INTERVAL=1
*NODE FILE,NSET=NLOADED
 U,
**************
*OUTPUT, FIELD, NUMBER INTERVAL = 1
*NODE OUTPUT,NSET=QA_TEST
 U,
*OUTPUT, HISTORY, TIME INT=0.04
*ENERGY OUTPUT,VAR=ALL
*****************
*OUTPUT, HISTORY, TIME INT=0.002
*NODE OUTPUT,NSET=NLOADED
U,
*****************
*OUTPUT, FIELD, NUMBER INTERVAL = 4
*ELEMENT OUTPUT, ELSET=EALL
S,
*NODE OUTPUT
U,
****************
*END STEP