*Heading
** Job name: Job-3 Model name: Model-1
**
** PARTS
**
*Part, name=Part-1
*End Part
**
** ASSEMBLY
**
*Assembly, name=Assembly
**
*Instance, name=Part-1-1, part=Part-1
*Node
*Element, type=SC8R
** Region: (Section-1:Picked)
*Elset, elset=_PickedSet2, internal, generate
** Section: Section-1
*Shell Section, elset=_PickedSet2, material=Material-1,POISSON=ELASTIC
1.,
*End Instance
*Nset, Nset=BC, Instance=Part-1-1
*Nset, Nset=SB, Instance=Part-1-1
*SUBMODEL, SHELL to Solid, Shell Thickness=1.0
SB
*End Assembly
**
** MATERIALS
**
*Material, name=Material-1
*Elastic
100000., 0.3
** ----------------------------------------------------------------
**
** STEP: Step-1
**
*Step, name=Step-1
*Static
1., 1., 1e-05, 1.
**
** BOUNDARY CONDITIONS
**
** Name: BC-1 Type: Displacement/Rotation
*Boundary
BC, 1, 3
*Boundary, Submodel, Step=1
SB, 1, 3
** OUTPUT REQUESTS
**
*Restart, write, frequency=1
**
** FIELD OUTPUT: F-Output-1
**
*Output, field, variable=PRESELECT
**
** HISTORY OUTPUT: H-Output-1
**
*Output, history, variable=PRESELECT
*El Print, freq=999999
s
*Node Print, freq=999999
u
*End Step