*HEADING
 Transfer from Standard to Standard : elastic
 - Second Standard analysis
*IMPORT,UPDATE=YES,STATE=YES,STEP=1
 EALL,
*RESTART, WRITE
*FILE FORMAT,ZERO INC
*NODE,NSET=ALL1
*NSET,NSET=BOTFACE2
*NSET,NSET=LEFT2
*NSET,NSET=LEFT
 LEFT1,LEFT2
*NSET,NSET=BOT2
*NSET,NSET=BOT
 BOT1,BOT2
*NSET,NSET=DISP2
*ELEMENT,TYPE=SC8R,ELSET=EALL1
*SHELL SECTION,ELSET=EALL1,MATERIAL=MAT2
 0.1,
*MATERIAL,NAME=MAT2
*ELASTIC
 200.E9,0.3
*PLASTIC
 300.E8,0.0
 350.E8,0.1
*STEP,NLGEOM
*STATIC
.1,1.
*BOUNDARY
 LEFT,1,1
 BOT,2,2
 DISP, 1,1
 DISP1,1,1,0.1
 DISP2,1,1,0.2
 BOTFACE,3,3
 BOTFACE2,3,3
*EL PRINT
 EE,
 PE,
 S,
 SE,
 SF,
 STH,
*NODE PRINT
 U,
 RF,
 COORD,
*OUTPUT,FIELD,VARIABLE=PRESELECT
*ELEMENT OUTPUT
 EE,
 PE,
 S,
 SE,
 SF,
 STH,
*NODE OUTPUT
 U,
 RF,
 COORD,
*END STEP