*HEADING
 Transfer from Standard to Standard : elastic
 - Second Standard analysis
 - Reference solution to ss1_s4r_ep_y_n
*IMPORT,UPDATE=YES,STATE=NO,STEP=1
EALL,
*RESTART, WRITE
*FILE FORMAT,ZERO INC
*NODE,NSET=ALL1
*NSET,NSET=LEFT2
*NSET,NSET=LEFT
LEFT1,LEFT2
*NSET,NSET=BOT2
*NSET,NSET=BOT
BOT1,BOT2
*NSET,NSET=DISP2
*ELEMENT,TYPE=S4R,ELSET=EALL1
*SHELL SECTION,ELSET=EALL1,MATERIAL=MAT2
0.1,
*MATERIAL,NAME=MAT2
*ELASTIC
200.E9,0.3
*PLASTIC
300.E8,0.0
350.E8,0.1
*STEP,NLGEOM
*STATIC
.1,1.
*BOUNDARY, TYPE=VELOCITY
LEFT,XSYMM
LEFT,3,3
BOT,YSYMM
BOT,3,3
DISP, 1,1
DISP1,1,1,0.1
DISP2,1,1,0.2
*NODE FILE
COORD,
*EL FILE
S,
EE,
LE,
PE,
STH,
*OUTPUT,FIELD,VARIABLE=PRESELECT
*ELEMENT OUTPUT
S,
EE,
PE,
STH,
*NODE OUTPUT
COORD
*END STEP