*HEADING
 Transfer from Standard to Standard: elastic+plastic
 - First Standard analysis
*RESTART,WRITE
*NODE,NSET=ALL
*NSET, NSET=BOTFACE
*NSET,NSET=LEFT1
*NSET,NSET=BOT1
*NSET,NSET=DISP
*NSET,NSET=DISP1
*ELEMENT,TYPE=SC8R,ELSET=EALL
*SHELL SECTION,ELSET=EALL,MATERIAL=MAT1
 0.1,
*MATERIAL,NAME=MAT1
*ELASTIC
 200.E9,0.3
*PLASTIC
  300.E8,0.0
  350.E8,0.1
*STEP,NLGEOM
*STATIC
.1,1.
*CONTROLS, PARAMETER=FIELD, FIELD=DISPLACEMENT
 1.0e-8
*BOUNDARY
 LEFT1,1,1
 BOT1,2,2
 DISP,1,1,0.2
 DISP1,1,1,0.1
 BOTFACE,3,3
*OUTPUT,FIELD,VARIABLE=PRESELECT
*ELEMENT OUTPUT
 EE,
 PE,
 S,
 SE,
 SF,
 STH,
*NODE OUTPUT
 U,
 RF,
 COORD,
*END STEP
*STEP,NLGEOM
*STATIC
1.,1.
*BOUNDARY, OP=MOD
DISP1,1,1,0.2
*END STEP