*HEADING
 Transfer from Standard to Standard: elastic+plastic
 - First Standard analysis
 - Element property assignment for thickness and offset
*RESTART,WRITE
*NODE,NSET=ALL
*NSET,NSET=DISP
*NSET,NSET=DISP1
*ELEMENT,TYPE=SAX1,ELSET=EALLA
*SHELL SECTION,ELSET=EALLA,MATERIAL=MAT1
0.1,
*ELEMENT,TYPE=SAX1,ELSET=EALLB
*SHELL SECTION,ELSET=EALLB,MATERIAL=MAT1, OFFSET=0.5
1.,
*DISTRIBUTION, NAME=DIST_THICK, LOCATION=ELEMENT, TYPE=SCALAR
 EALLB, 0.1
*DISTRIBUTION, NAME=DIST_OFFSET, LOCATION=ELEMENT, TYPE=SCALAR
 EALLB, 0.
*ELEMENT PROPERTIES
 THICKNESS, DIST_THICK
 OFFSET, DIST_OFFSET
*MATERIAL,NAME=MAT1
*ELASTIC
200.E9,0.3
*PLASTIC
300.E8,0.0
350.E8,0.1
*STEP,NLGEOM
*STATIC
.1,1.
*BOUNDARY
1, 1,2
1, 6,6
11,1,2
11,6,6
2, 2,2
12,2,2
DISP,1,1,0.2
DISP1,1,1,0.1
*EL FILE
S,
EE,
PE,
STH,
*NODE FILE
COORD,
*OUTPUT,FIELD
*ELEMENT OUTPUT
S,
EE,
PE,
STH,
*NODE OUTPUT
COORD
*END STEP
*STEP,NLGEOM
*STATIC
.1,1.
*BOUNDARY, OP=MOD
DISP1,1,1,0.2
*EL FILE
S,
EE,
LE,
PE,
STH,
*NODE FILE
COORD,
*END STEP