*HEADING
 Transfer from Standard to Standard: elastic+plastic
 - First Standard analysis
 - Element property assignment for thickness, offset, and orientation
*RESTART,WRITE
*NODE,NSET=ALL
*NSET,NSET=LEFT1
*NSET,NSET=BOT1
*NSET,NSET=DISP
*NSET,NSET=DISP1
*ELEMENT,TYPE=S4R,ELSET=EALL
*SHELL SECTION,ELSET=EALL,MATERIAL=MAT1, OFFSET=0.5
 1.,
*DISTRIBUTION, NAME=DIST_THICK, LOCATION=ELEMENT, TYPE=SCALAR
 EALL, 0.1
*DISTRIBUTION, NAME=DIST_OFFSET, LOCATION=ELEMENT, TYPE=SCALAR
 EALL, 0.
*DISTRIBUTION, NAME=DIST_ORIENT, LOCATION=ELEMENT, TYPE=ORIENT
 EALL,  1.,1.,0., -1.,1.,0.
*ELEMENT PROPERTIES
 THICKNESS, DIST_THICK
 OFFSET, DIST_OFFSET
 ORIENTATION, DIST_ORIENT
*MATERIAL,NAME=MAT1
*ELASTIC
 200.E9,0.3
*PLASTIC
 300.E8,0.0
 350.E8,0.1
*STEP,NLGEOM
*STATIC
 .1,1.
*BOUNDARY
 LEFT1,XSYMM
 LEFT1,3,3
 BOT1,YSYMM
 BOT1,3,3
 DISP,1,1,0.2
 DISP1,1,1,0.1
*EL FILE
 S,
 EE,
 PE,
 STH,
*NODE FILE
 COORD,
*OUTPUT,FIELD
*ELEMENT OUTPUT
 S,
 EE,
 PE,
 STH,
*NODE OUTPUT
 COORD,
*END STEP
*STEP,NLGEOM
*STATIC
.1,1.
*BOUNDARY, OP=MOD
 DISP1,1,1,0.2
*EL FILE
 S,
 EE,
 LE,
 PE,
 STH,
*NODE FILE
 COORD,
*OUTPUT,FIELD
*ELEMENT OUTPUT
 S,
 EE,
 PE,
 STH,
*NODE OUTPUT
 COORD,
*END STEP