*Heading
** Job name: snubber Model name: Model-1
**
** PARTS
**
*Part, name=ARM
*End Part
*Part, name=BLOCK
*End Part
*Part, name=COWLING
*End Part
*Part, name=SHOE
*End Part
**
** ASSEMBLY
**
*Assembly, name=Assembly
**
*Instance, name=ARM-1, part=ARM
*Node
*Element, type=S3
*Element, type=B31
*End Instance
**
*Instance, name=BLOCK-1, part=BLOCK
*Node
*Nset, nset=BLOCK-1-RefPt_, internal
*Surface, type=SEGMENTS, name=RigidSurface_, internal
START, -1.81173331571765, 6.76148078402348
 LINE, -1.81173331571765,          7.5
 LINE, 1.81173331571765,          7.5
 LINE, 1.81173331571765, 6.76148078402348
 CIRCL, -1.81173331571765, 6.76148078402348,           0.,           0.
*Rigid Body, ref node=BLOCK-1-RefPt_, analytical surface=RigidSurface_
*End Instance
**
*Instance, name=COWLING-1, part=COWLING
*Node
*Element, type=S3
*Element, type=B31
*End Instance
**
*Instance, name=SHOE-1, part=SHOE
*Node
*Element, type=CPS4R
** Region: (Section-1:Picked)
*Elset, elset=_I1, internal, generate
** Section: Section-1
*Solid Section, elset=_I1, material=StiffMat
1.,
*End Instance
*Node
*Node
*Node
*Nset, nset=Set-1
*Nset, nset=_PickedSet24, internal
*Nset, nset=_PickedSet25, internal
*Nset, nset=_PickedSet26, internal
*Nset, nset=_PickedSet27, internal
*Nset, nset=_PickedSet28, internal, instance=SHOE-1
*Elset, elset=_PickedSet28, internal, instance=SHOE-1, generate
*Nset, nset=_PickedSet31, internal, instance=BLOCK-1
*Nset, nset=_PickedSet32, internal
*Nset, nset=_PickedSet33, internal
*Elset, elset=__PickedSurf30_S1, internal, instance=SHOE-1
*Elset, elset=__PickedSurf30_S2, internal, instance=SHOE-1, generate
*Elset, elset=__PickedSurf30_S3, internal, instance=SHOE-1
*Surface, type=ELEMENT, name=_PickedSurf30, internal
__PickedSurf30_S1, S1
__PickedSurf30_S2, S2
__PickedSurf30_S3, S3
** Constraint: Constraint-1
*Display Body, instance=COWLING-1
** Constraint: Constraint-2
*Display Body, instance=ARM-1
** Constraint: Constraint-3
*Rigid Body, ref node=_PickedSet24, tie nset=Set-1
** Constraint: Constraint-4
*Rigid Body, ref node=_PickedSet25, tie nset=_PickedSet26
** Constraint: Constraint-5
*Rigid Body, ref node=_PickedSet27, elset=_PickedSet28
**
** CONNECTORS
**
*Element, type=CONN2D2, elset=_JOIN-ARM-SHOE_CnSet_
*Connector Section, elset=_JOIN-ARM-SHOE_CnSet_, behavior=JOIN-2
CARTESIAN, Rotation
*Element, type=CONN2D2, elset=_JOIN-COWLING-ARM_CnSet_
*Connector Section, elset=_JOIN-COWLING-ARM_CnSet_, behavior=JOIN-1
Join, Rotation
*Element, type=CONN2D2, elset=_SPRING-COWLING-ARM_CnSet_
*Connector Section, elset=_SPRING-COWLING-ARM_CnSet_, behavior=SPRING
Axial,
*End Assembly
*Amplitude, name=Amp-1
0., 0., 1., -0.087266, 2., 0., 3., 0.087266
**
** MATERIALS
**
*Material, name=StiffMat
*Elastic
30000.,0.
*Connector Behavior, name=JOIN-1
*Connector Stop, component=6
*Connector Behavior, name=JOIN-2
*Connector Elasticity, component=6
*CONNECTOR ELASTICITY, RIGID
*CONNECTOR PLASTICITY
*CONNECTOR POTENTIAL
*CONNECTOR HARDENING
*Connector Behavior, name=SPRING
*Connector Constitutive Reference
*Connector Elasticity, component=1
*CONNECTOR PLASTICITY, COMPONENT=1
*CONNECTOR HARDENING
**
** INTERACTION PROPERTIES
**
*Surface Interaction, name=IntProp-1
1.,
*friction
 0.5,
*Surface Behavior, augmented lagrange
**
** BOUNDARY CONDITIONS
**
** Name: BLOCK-FIXED Type: Displacement/Rotation
*Boundary
_PickedSet31, 1, 1
_PickedSet31, 2, 2
_PickedSet31, 6, 6
** Name: COWLING-NO-TRANSLATION Type: Displacement/Rotation
*Boundary
_PickedSet32, 1, 1
_PickedSet32, 2, 2
**
** INTERACTIONS
**
** Interaction: Int-1
*Contact Pair, interaction=IntProp-1, adjust=0.001
_PickedSurf30, BLOCK-1.RigidSurface_
** ----------------------------------------------------------------
**
** STEP: Step-1
**
*Step, name=Step-1, nlgeom
*Static
0.001, 3., , 0.1
**
** BOUNDARY CONDITIONS
**
** Name: COWLING-ROTATE Type: Displacement/Rotation
*Boundary, amplitude=Amp-1
_PickedSet33, 6, 6, 1.
**
** OUTPUT REQUESTS
**
*Restart, write, frequency=1
**
** FIELD OUTPUT: F-Output-1
**
*Output, field, variable=PRESELECT
**
** HISTORY OUTPUT: H-Output-1
**
*Output, history, variable=PRESELECT
*El Print, freq=999999
*Node Print, freq=999999
*output, history, frequency=1
*element output, elset=_JOIN-ARM-SHOE_CnSet_
CRF, CEF, CU, CUP, CUPEQC
*element output, elset=_SPRING-COWLING-ARM_CnSet_
CRF, CEF, CU, CUP, CUPEQ1
*End Step