*Heading
** Job name: slide-shell-on-solid Model name: model-2
*Preprint, echo=NO, model=NO, history=NO, contact=NO
**
** PARTS
**
*Part, name=Part-1
*Node
*Element, type=C3D8R
*Nset, nset=_PickedSet2, internal, generate
*Elset, elset=_PickedSet2, internal, generate
** Region: (SOLID_SECT:Picked)
*Elset, elset=_PickedSet2, internal, generate
** Section: SOLID_SECT
*Solid Section, elset=_PickedSet2, material=SHELLMAT
1.,
*End Part
**
*Part, name=Part-2
*Node
*Element, type=S4R
*Nset, nset=_PickedSet2, internal, generate
*Elset, elset=_PickedSet2, internal
** Region: (SHELL_TOP:Picked)
*Elset, elset=_PickedSet2, internal
** Section: SHELL_TOP
*Shell Section, elset=_PickedSet2, material=SHELLMAT
1., 5
*End Part
**
**
** ASSEMBLY
**
*Assembly, name=Assembly
**
*Instance, name=Part-1-1, part=Part-1
*End Instance
**
*Instance, name=Part-2-1, part=Part-2
*End Instance
**
*Nset, nset=_PickedSet36, internal, instance=Part-1-1
*Elset, elset=_PickedSet36, internal, instance=Part-1-1, generate
*Nset, nset=_PickedSet37, internal, instance=Part-2-1, generate
*Elset, elset=_PickedSet37, internal, instance=Part-2-1
*Nset, nset=_PickedSet38, internal, instance=Part-2-1, generate
*Elset, elset=_PickedSet38, internal, instance=Part-2-1
*Elset, elset=_BOT_SURF_S3, internal, instance=Part-1-1, generate
*Surface, type=ELEMENT, name=BOT_SURF
_BOT_SURF_S3, S3
*Elset, elset=_TOP_SURF_SNEG, internal, instance=Part-2-1
*Surface, type=ELEMENT, name=TOP_SURF
_TOP_SURF_SNEG, SNEG
*End Assembly
**
** MATERIALS
**
*Material, name=SHELLMAT
*Density
7700.,
*Elastic
 3e+07, 0.3
**
** INTERACTION PROPERTIES
**
*Surface Interaction, name=NOFRIC
1.,
*Friction
0.,
**
** BOUNDARY CONDITIONS
**
** Name: FIXED Type: Symmetry/Antisymmetry/Encastre
*Boundary
_PickedSet36, ENCASTRE
**
** INTERACTIONS
**
** Interaction: SLIDING
*Contact Pair, interaction=NOFRIC, type=SURFACE TO SURFACE
TOP_SURF, BOT_SURF
** ----------------------------------------------------------------
**
** STEP: COMPRESS
**
*Step, name=COMPRESS, nlgeom=YES
*Static
1., 1., 1e-05, 1.
**
** BOUNDARY CONDITIONS
**
** Name: PUSH_DOWN Type: Displacement/Rotation
*Boundary
_PickedSet37, 1, 1
_PickedSet37, 2, 2
_PickedSet37, 3, 3, -0.05
**
** OUTPUT REQUESTS
**
*Restart, write, frequency=0
**
** FIELD OUTPUT: F-Output-1
**
*Output, field, variable=PRESELECT
**
** HISTORY OUTPUT: H-Output-1
**
*Output, history, variable=PRESELECT
*End Step
** ----------------------------------------------------------------
**
** STEP: SLIDE
**
*Step, name=SLIDE, nlgeom=YES
*Static
0.1, 1., 1e-05, 0.2
**
** BOUNDARY CONDITIONS
**
** Name: FIXED Type: Symmetry/Antisymmetry/Encastre
*Boundary, op=NEW
_PickedSet36, ENCASTRE
** Name: PUSH_DOWN Type: Displacement/Rotation
*Boundary, op=NEW
** Name: SLIDE Type: Displacement/Rotation
*Boundary, op=NEW
_PickedSet38, 1, 1
_PickedSet38, 2, 2, 5.
_PickedSet38, 3, 3, -0.05
**
** OUTPUT REQUESTS
**
*Restart, write, frequency=0
**
** FIELD OUTPUT: F-Output-1
**
*Output, field, variable=PRESELECT
**
** HISTORY OUTPUT: H-Output-1
**
*Output, history, variable=PRESELECT
*End Step