*Heading
 Rear Bushing Conn Motion dof 1 +9
** Job name: rearBushing_test1a Model name: RB_Test1_1_9
*Preprint, echo=NO, model=NO, history=NO, contact=NO
**
** PARTS
**
*Part, name=InnerSurfaceDCOUP
*End Part
**
*Part, name=InnerTube
*End Part
**
*Part, name=OuterSurfaceDCOUP
*End Part
**
*Part, name=OuterTube
*End Part
**
*Part, name=Rubber
*Node
*Element, type=C3D8
*Nset, nset=_PickedSet20, internal, generate
*Elset, elset=_PickedSet20, internal, generate
*Elset, elset=_Surf-1_S6, internal
*Elset, elset=_Surf-1_S4, internal
*Elset, elset=_Surf-1_S5, internal
*Elset, elset=_Surf-1_S3, internal
*Surface, type=ELEMENT, name=Surf-1
_Surf-1_S6, S6
_Surf-1_S4, S4
_Surf-1_S5, S5
_Surf-1_S3, S3
*Elset, elset=_Surf-2_S4, internal
*Elset, elset=_Surf-2_S5, internal
*Surface, type=ELEMENT, name=Surf-2
_Surf-2_S4, S4
_Surf-2_S5, S5
*Elset, elset=_Surf-3_S3, internal
*Elset, elset=_Surf-3_S6, internal
*Elset, elset=_Surf-3_S4, internal
*Elset, elset=_Surf-3_S5, internal
*Surface, type=ELEMENT, name=Surf-3
_Surf-3_S3, S3
_Surf-3_S6, S6
_Surf-3_S4, S4
_Surf-3_S5, S5
*Elset, elset=_Surf-4_S6, internal
*Elset, elset=_Surf-4_S5, internal
*Elset, elset=_Surf-4_S4, internal
*Elset, elset=_Surf-4_S3, internal
*Surface, type=ELEMENT, name=Surf-4
_Surf-4_S6, S6
_Surf-4_S5, S5
_Surf-4_S4, S4
_Surf-4_S3, S3
** Region: (Rubber:Picked)
*Elset, elset=_PickedSet20, internal, generate
** Section: Rubber
*Solid Section, elset=_PickedSet20, material=Rubber
1.,
*End Part
**
**
** ASSEMBLY
**
*Assembly, name=Assembly
**
*Instance, name=InnerTube-1, part=InnerTube
*Node
*Element, type=C3D8
*Nset, nset=_PickedSet2, internal, generate
*Elset, elset=_PickedSet2, internal, generate
*Nset, nset=_PickedSet3, internal, generate
*Elset, elset=_PickedSet3, internal, generate
** Region: (Steel:Picked)
*Elset, elset=_PickedSet3, internal, generate
** Section: Steel
*Solid Section, elset=_PickedSet3, material=Steel
1.,
*End Instance
**
*Instance, name=OuterTube-1, part=OuterTube
*Node
*Element, type=C3D8
*Nset, nset=_PickedSet2, internal, generate
*Elset, elset=_PickedSet2, internal, generate
*Nset, nset=_PickedSet3, internal, generate
*Elset, elset=_PickedSet3, internal, generate
** Region: (Steel:Picked)
*Elset, elset=_PickedSet3, internal, generate
** Section: Steel
*Solid Section, elset=_PickedSet3, material=Steel
1.,
*End Instance
**
*Instance, name=Rubber-1, part=Rubber
*End Instance
**
*Instance, name=InnerSurfaceDCOUP-1, part=InnerSurfaceDCOUP
*Node
*Nset, nset=InnerSurfaceDCOUP-1-RefPt_, internal
*End Instance
**
*Instance, name=OuterSurfaceDCOUP-1, part=OuterSurfaceDCOUP
*Node
*Nset, nset=OuterSurfaceDCOUP-1-RefPt_, internal
*End Instance
**
*Nset, nset=OuterTubeOuterSurface, instance=OuterTube-1
*Elset, elset=OuterTubeOuterSurface, instance=OuterTube-1, generate
*Nset, nset=InnerTubeInnerSurface, instance=InnerTube-1
*Elset, elset=InnerTubeInnerSurface, instance=InnerTube-1, generate
*Nset, nset=InnerSufaceDcoupRP, instance=InnerSurfaceDCOUP-1
*Nset, nset=OuterSurfaceDcoupRP, instance=OuterSurfaceDCOUP-1
*Elset, elset=__PickedSurf27_S4, internal, instance=OuterTube-1
*Elset, elset=__PickedSurf27_S6, internal, instance=OuterTube-1
*Surface, type=ELEMENT, name=_PickedSurf27, internal
__PickedSurf27_S4, S4
__PickedSurf27_S6, S6
*Elset, elset=__PickedSurf28_S4, internal, instance=Rubber-1
*Elset, elset=__PickedSurf28_S5, internal, instance=Rubber-1
*Surface, type=ELEMENT, name=_PickedSurf28, internal
__PickedSurf28_S4, S4
__PickedSurf28_S5, S5
*Elset, elset=__PickedSurf29_S4, internal, instance=InnerTube-1
*Elset, elset=__PickedSurf29_S6, internal, instance=InnerTube-1
*Surface, type=ELEMENT, name=_PickedSurf29, internal
__PickedSurf29_S4, S4
__PickedSurf29_S6, S6
*Elset, elset=__PickedSurf30_S6, internal, instance=Rubber-1
*Elset, elset=__PickedSurf30_S4, internal, instance=Rubber-1
*Elset, elset=__PickedSurf30_S5, internal, instance=Rubber-1
*Elset, elset=__PickedSurf30_S3, internal, instance=Rubber-1
*Surface, type=ELEMENT, name=_PickedSurf30, internal
__PickedSurf30_S6, S6
__PickedSurf30_S4, S4
__PickedSurf30_S5, S5
__PickedSurf30_S3, S3
*Elset, elset=_InnerTubeInner_S4, internal, instance=InnerTube-1
*Elset, elset=_InnerTubeInner_S6, internal, instance=InnerTube-1
*Surface, type=ELEMENT, name=InnerTubeInner
_InnerTubeInner_S4, S4
_InnerTubeInner_S6, S6
*Elset, elset=_OuterTubeOuter_S4, internal, instance=OuterTube-1
*Elset, elset=_OuterTubeOuter_S6, internal, instance=OuterTube-1
*Surface, type=ELEMENT, name=OuterTubeOuter
_OuterTubeOuter_S4, S4
_OuterTubeOuter_S6, S6
*Orientation, name="Datum csys-1"
*Orientation, name="Datum csys-2"
** Constraint: InnerDcoup
*Coupling, constraint name=InnerDcoup, ref node=InnerSufaceDcoupRP, surface=InnerTubeInner
*Distributing, weighting method=UNIFORM
** Constraint: OuterDcoup
*Coupling, constraint name=OuterDcoup, ref node=OuterSurfaceDcoupRP, surface=OuterTubeOuter
*Distributing, weighting method=UNIFORM
** Constraint: TieInnerTubeToRubber
*Tie, name=TieInnerTubeToRubber, adjust=yes
_PickedSurf30, _PickedSurf29
** Constraint: TieOuterTubeToRubber
*Tie, name=TieOuterTubeToRubber, adjust=yes
_PickedSurf28, _PickedSurf27
**
** CONNECTORS
**
*Element, type=CONN3D2, elset=_RearBushing_CnSet_
1, OuterSurfaceDCOUP-1.1, InnerSurfaceDCOUP-1.1
*Connector Section, elset=_RearBushing_CnSet_
Bushing,
"Datum csys-1", "Datum csys-2"
*Elset, elset=_BusingMotion_CnSet_, internal
_RearBushing_CnSet_,
*End Assembly
**
** MATERIALS
**
*Material, name=Rubber
*Hyperelastic, n=2, ogden
 1.67099,     9.00665, 0.000215372,     -4.8694,          1.,          1.
*Material, name=Steel
*Elastic
210000., 0.3
**
** INTERACTION PROPERTIES
**
*Surface Interaction, name=IntProp-1
1.,
*Surface Behavior, augmented Lagrange
**
** INTERACTIONS
**
** Interaction: Int-1
*Contact Pair, interaction=IntProp-1,type=surface
Rubber-1.Surf-3,
** Interaction: Int-2
*Contact Pair, interaction=IntProp-1,type=surface
Rubber-1.Surf-4,
** ----------------------------------------------------------------
**
** STEP: Step-1
**
*Step, name=Step-1, nlgeom=YES
*Static
0.01, 1., 1e-05, 1.
**
** BOUNDARY CONDITIONS
**
** Name: BusingMotion Type: Connector displacement
** Applies To: RearBushing
*Connector Motion
_BusingMotion_CnSet_, 1, 9.
_BusingMotion_CnSet_, 2
_BusingMotion_CnSet_, 3
_BusingMotion_CnSet_, 4
_BusingMotion_CnSet_, 5
_BusingMotion_CnSet_, 6
** Name: FixedOutsideOfBushing Type: Symmetry/Antisymmetry/Encastre
*Boundary
OuterSurfaceDcoupRP, ENCASTRE
**
** OUTPUT REQUESTS
**
*Restart, write, frequency=0
**
** FIELD OUTPUT: F-Output-1
**
*Output, field, frequency=99999
*Node Output
U,
**
** HISTORY OUTPUT: H-Output-2
**
*Output, history
*Element Output, elset=_RearBushing_CnSet_
CRF1, CRF2, CRF3, CRM1, CRM2, CRM3, CU1, CU2, CU3, CUR1, CUR2, CUR3
**
** HISTORY OUTPUT: H-Output-1
**
*Output, history, variable=PRESELECT
*End Step