*HEADING
:  SUBMODEL FOR PGC24DFS [DC2D4]
*NODE,NSET=NL
*NODE,NSET=NR
*NGEN,NSET=NL
*NGEN,NSET=NR
*NFILL,NSET=NALL
NL,NR,3,4
*NSET,NSET=FIX1
*NSET,NSET=FIX2
*NSET,NSET=FIX3
*NSET,NSET=FIX4
*SUBMODEL
FIX1,FIX3,FIX4
*ELEMENT,TYPE=DC2D4,ELSET=EALL
*ELGEN,ELSET=EALL
*SOLID SECTION,MATERIAL=A1, ELSET=EALL
*MATERIAL,NAME=A1
*CONDUCTIVITY
4.85E-4,
*DENSITY
0.283,
*SPECIFIC HEAT
0.116,
*STEP
*HEAT TRANSFER,END=PERIOD
0.2,1.0
*BOUNDARY,SUBMODEL,STEP=1
FIX1,11,11
FIX3,11,11
FIX4,11,11
*NODE PRINT
NT,
*NODE FILE,FREQ=999
NT,
*EL PRINT,POSITION=CENTROID
 HFL,
*EL FILE,POSITION=CENTROID,FREQ=999
 HFL,
*ENDSTEP