*Heading
CGAX8RT elements
elastic plastic materials
static procedure
**
*system
*Node
*Nset, nset=top
*Nset, nset=bottom
*Nset, nset=left
*Nset, nset=right
*Nset, nset=centerpoint
*Nset, nset=centerline
*element,type=cgax8rt
*Elset, elset=leftsection, generate
*element,type=cgax8rt
*Elset, elset=rightsection, generate
**
*solid section, elset=rightsection,material=softelpl
1.0,
*solid section, elset=leftsection,material=hardelpl
1.0,
*Material, name=softelpl
*Elastic
1.E4, 0.3
*Plastic
8.E3,
*conductivity
1.0E6,
*density
1.0,
*specific heat
1.0,
*Material, name=hardelpl
*Elastic
1.E5, 0.3
*Plastic
8.E4,
*conductivity
1.0E6,
*density
1.0,
*specific heat
1.0,
**
*map solution, step = 1
*Step, nlgeom, inc=100
Hold
*Coupled Temperature-Displacement, Deltmx = 1000.
1.,1.
*controls,parameters=field
,1.
**
*boundary,op=new
bottom,ysymm
centerline,xsymm
top,2,2,0.0
right,1,1,0.0
left,1,1,0.0
*Restart, write, frequency=1
*Output, field, op=NEW, frequency=1
*Node Output
U, NT
*Element Output
S, E, PEEQ
*node file,freq=9999
U, NT
*el file,freq=9999
S, E, PE
*End Step