*Heading
CAX3H elements
elastic materials
static procedure
**
*system
*Node
*Nset, nset=top
*Nset, nset=bottom
*Nset, nset=left
*Nset, nset=right
*Nset, nset=centerpoint
*Nset, nset=centerline
*Elset, elset=centerline
*element,type=cax3h
*Elset, elset=leftsection, generate
*element,type=cax3h
*Elset, elset=rightsection, generate
**
*solid section, elset=rightsection,material=softelastic
1.0,
*solid section, elset=leftsection,material=hardelastic
1.0,
*Material, name=softelastic
*Elastic
1.E4, 0.3
*conductivity
1.0,
*density
1.0,
*Material, name=hardelastic
*Elastic
1.E5, 0.3
*conductivity
1.0,
*density
1.0,
**
*Step, nlgeom, inc=100
Push down
*Static
0.1, 1.,
**
*boundary
bottom,ysymm
centerline,xsymm
top,2,2,-20.0
right,1,1,10.0
left,1,1,-10.0
*Restart, write, frequency=1
*Output, field, op=NEW, frequency=1
*Node Output
U,
*Element Output
S, E
*node file,freq=9999
U,
*el file,freq=9999
S, E
*End Step