*Heading
** Job name: 2D Model name: Model-1
**
** PARTS
**
*Part, name=Block
*End Part
**
** ASSEMBLY
**
*Assembly, name=Assembly
**
*Instance, name=Block-1, part=Block
*Node
*Element, type=C3D20RT
** Region: (Left Section:Picked)
*Elset, elset=_I1, internal, generate
** Section: Left Section
*Solid Section, elset=_I1, material=Left Material
1.,
** Region: (Right Section:Picked)
*Elset, elset=_I2, internal, generate
** Section: Right Section
*Solid Section, elset=_I2, material=Right Matertial
1.,
*End Instance
*Nset, nset="Bottom Face", instance=Block-1
*Elset, elset="Bottom Face", instance=Block-1
*Nset, nset="Top Face", instance=Block-1
*Elset, elset="Top Face", instance=Block-1
*Nset, nset="Front Point", instance=Block-1
*Nset, nset="Back Point", instance=Block-1
*Nset, nset="Front Face", instance=Block-1
*Elset, elset="Front Face", instance=Block-1
*Nset, nset="Back Face", instance=Block-1
*Elset, elset="Back Face", instance=Block-1
*Nset, nset="Right Face", instance=Block-1
*Elset, elset="Right Face", instance=Block-1
*Nset, nset="Left Face", instance=Block-1
*Elset, elset="Left Face", instance=Block-1, generate
*Nset, nset="Mid Face", instance=Block-1
*Elset, elset="Mid Face", instance=Block-1, generate
*End Assembly
**
** MATERIALS
**
*Material, name=Left Material
*Elastic
10000., 0.3
*Conductivity
1.E6,
*Density
1.0,
*Material, name=Right Matertial
*Elastic
100000., 0.3
*Conductivity
1.E6,
*Density
1.0,
** ----------------------------------------------------------------
**
** STEP: Step-1
**
*map solution
*Step, name=Step-1, nlgeom
Compress the block
*Coupled temperature-displacement,deltmx=1000.0
0.1, 1., 1e-05, 1.
**
** BOUNDARY CONDITIONS
**
*boundary
"Left Face",11,11,0.0
"Right Face",11,11,1000.0
** Name: BC-1 Type: Symmetry/Antisymmetry/Encastre
*Boundary
"Bottom Face", YSYMM
** Name: BC-2 Type: Symmetry/Antisymmetry/Encastre
*Boundary
"Front Face", ZSYMM
** Name: BC-3 Type: Symmetry/Antisymmetry/Encastre
*Boundary
"Back Face", ZSYMM
** Name: BC-4 Type: Symmetry/Antisymmetry/Encastre
*Boundary
"Mid Face", XSYMM
** Name: BC-5 Type: Displacement/Rotation
*Boundary
"Top Face", 2, 2, 10.
** Name: BC-6 Type: Displacement/Rotation
*Boundary
"Right Face", 1, 1, -5.
** Name: BC-7 Type: Displacement/Rotation
*Boundary
"Left Face", 1, 1, 5.
**
** OUTPUT REQUESTS
**
*Restart, write, frequency=1
**
** FIELD OUTPUT: F-Output-1
**
*Output, field, variable=PRESELECT, frequency=9999
**
** HISTORY OUTPUT: H-Output-1
**
*Output, history, variable=PRESELECT, frequency=9999
*El Print, freq=999999
*Node Print, freq=999999
*End Step