*HEADING
: Uniaxial tension [CPEG3,CPEG4]
  Lines padded with spaces to test 132 chararcter limit
*restart,write,freq=999
*preprint,model=yes,history=yes,echo=yes
*NODE,NSET=NL
*NODE,NSET=NR
*NODE
*NFILL
 NL,NR,4,100
*ELEMENT,TYPE=CPEG3,ELSET=EALL
*ELEMENT,TYPE=CPEG4,ELSET=EALL
*ELGEN,ELSET=EALL
*ELSET,ELSET=E1
*SOLID SECTION,MATERIAL=A1, ELSET=EALL,REFNODE=998
*MATERIAL,NAME=A1
*ELASTIC,TYPE=ISOTROPIC
 30.0E6,0.3
*ELSET,ELSET=LOAD
*BOUNDARY
 NL,1,1
 1,2
*STEP
*STATIC
 0.5,1.
*BOUNDARY
 998,3,5,0.
*DLOAD,OP=NEW
 LOAD,P2, -1000000.0
*EL FILE,ELSET=E1
 S,E,
*OUTPUT,FIELD
*ELEMENT OUTPUT,ELSET=E1
 S,E,
*NODE FILE
 U,RF
*OUTPUT,FIELD
*NODE OUTPUT
 U,RF
*NODE PRINT
 U,
 RF,
*END STEP
*STEP
*STATIC
 0.5,1.
*BOUNDARY
 998,3,5,0.
*DLOAD,OP=NEW
 LOAD,P2, -2000000.0
*EL FILE,ELSET=E1,FREQ=999
 S,E,
*OUTPUT,FIELD
*ELEMENT OUTPUT,ELSET=E1
 S,E,
*NODE FILE
 U,RF
*OUTPUT,FIELD
*NODE OUTPUT
 U,RF
*NODE PRINT
 U,
 RF,
*END STEP