*HEADING
: Uniaxial tension [C3D27]
*PREPRINT,ECHO=YES,HISTORY=NO,MODEL=NO
*NODE
*NGEN,NSET=EXTBOT
*NGEN,NSET=EXTOP
*NGEN,NSET=EXLEFT
*NGEN,NSET=EXRT
*NGEN,NSET=EXFRONT
*NGEN,NSET=EXBACK
*NGEN,NSET=INBOT
*NSET,NSET=INTOP
*NGEN,NSET=INLEFT
*NGEN,NSET=INRT
*NSET,NSET=INRT
*NGEN,NSET=INFRT
*NGEN,NSET=INBK
*NGEN,NSET=INOUTB
*NGEN,NSET=INOUTT
*NSET,NSET=INOUTT
*NGEN,NSET=INOUTL
*NGEN,NSET=INOUTR
*NGEN,NSET=CENTROID
*** EL 1
*** EL 2
*** EL 4
*** EL 5
*** EL 6
*** EL 7
*NSET,NSET=CENTROID
*** EL 3
*NSET,NSET=SIDES
*NSET,NSET=POINT
*NSET,NSET=LINE
*NSET,NSET=PLANE
*ELEMENT,TYPE=C3D27, ELSET=EALL
****
****
****
*ELSET,ELSET=EF
*ELSET,ELSET=LOAD
*SOLID SECTION,MATERIAL=A1, ELSET=EALL
*MATERIAL,NAME=A1
*ELASTIC
30.E6,0.3
*BOUNDARY
POINT,1,3
LINE,2,2
PLANE,1,1
*STEP
*STATIC
1.,1.
*DLOAD
LOAD,P4,-5.E5
*ENERGY FILE
*OUTPUT,HISTORY,FREQUENCY=1
*ENERGY OUTPUT,VARIABLE=PRESELECT
*EL FILE,ELSET=EF,FREQ=999
S,E,
*OUTPUT,FIELD,FREQ=999
*ELEMENT OUTPUT,ELSET=EF
S,E,
*NODE FILE,FREQ=999
U,RF
*OUTPUT,FIELD,FREQ=999
*NODE OUTPUT
U,RF
*EL PRINT,ELSET=EF,POSITION=AVERAGED,FREQ=999
S,
E,
*END STEP
*STEP
*STATIC
1.,1.
*DLOAD
LOAD,P4,-1.E6
*END STEP