*HEADING
: Uniaxial Tension [C3D20]
*NODE
*NSET,NSET=POINT
*NSET,NSET=LINE
*NSET,NSET=PLANE
*NGEN
*ELEMENT,TYPE=C3D20,ELSET=EALL
*ELSET,ELSET=LOAD
*SOLID SECTION,MATERIAL=MAT1,ELSET=EALL
*MATERIAL,NAME=MAT1
*ELASTIC
30.E6,0.3
*BOUNDARY
POINT,1,3
LINE,2,2
PLANE,1,1
*STEP
*STATIC
0.1,1.,0.05,1.
*DLOAD
LOAD,P4,-1.E6
*ENERGY FILE
*OUTPUT,HISTORY,FREQUENCY=1
*ENERGY OUTPUT,VARIABLE=PRESELECT
*EL FILE,ELSET=LOAD,FREQ=999
S,E,
*OUTPUT,FIELD,FREQ=999
*ELEMENT OUTPUT,ELSET=LOAD
S,E,
*NODE FILE,FREQ=4
U,RF
*OUTPUT,FIELD,FREQ=4
*NODE OUTPUT
U,RF
*EL PRINT,POSITION=NODES,FREQ=999
S,
E,
*NODE PRINT,FREQ=999
U,COORD
*END STEP