*HEADING
: NAFEMS TEST LE2, Cylindrical Shell Bending Patch Test  [S4R]
*NODE
*NGEN,NSET=EDGEAB
*NGEN,NSET=EDGECD
*NGEN,NSET=EDGEAD
*NGEN,NSET=EDGEBC
*NGEN
*NSET,NSET=NALL,GEN
*NMAP,NSET=NALL,TYPE=CYLINDRICAL
*ELEMENT,TYPE=S4R,ELSET=ALLELS
*ELGEN,ELSET=ALLELS
*MATERIAL,NAME=MAT
*ELASTIC,TYPE=ISOTROPIC
2.1E5,0.3
*SHELL SECTION,MATERIAL=MAT,ELSET=ALLELS,CONTROLS=HGC
0.01,
*SECTION CONTROLS,NAME=HGC,HOURGLASS=ENHANCED
*TRANSFORM,TYPE=C,NSET=NALL
*BOUNDARY
 EDGEAD,ZSYMM
 EDGEBC,ZSYMM
 EDGEAB,1,6
*RESTART,WRITE
*STEP
*STATIC
*CLOAD
5,6,125.0
15,6,250.0,
25,6,125.0
*EL PRINT,POS=AVERAGED AT NODES
S,
*EL FILE,POS=AVERAGED AT NODES
S,
*END STEP