*HEADING
: NAFEMS TEST LE2, Cylindrical Shell Bending Patch Test  [S8R]
*NODE
*NGEN,NSET=EDGEAB
*NGEN,NSET=EDGECD
*NGEN,NSET=EDGEAD
*NGEN,NSET=EDGEBC
*NGEN
*NSET,NSET=NALL,GEN
*NMAP,NSET=NALL,TYPE=CYLINDRICAL
*ELEMENT,TYPE=S8R,ELSET=ALLELS
*ELGEN,ELSET=ALLELS
*MATERIAL,NAME=MAT
*ELASTIC,TYPE=ISOTROPIC
2.1E5,0.3
*SHELL SECTION,MATERIAL=MAT,ELSET=ALLELS
0.01,
*TRANSFORM,TYPE=C,NSET=NALL
*BOUNDARY
 EDGEAD,ZSYMM
 EDGEBC,ZSYMM
 EDGEAB,1,6
*RESTART,WRITE
*STEP
*STATIC
*CLOAD
 5,6,0.041667E3
 10,6,0.166667E3
 15,6,0.083333E3
 20,6,0.166667E3
 25,6,0.041667E3
*EL PRINT,POS=AVERAGED AT NODES
S,
*EL FILE,POS=AVERAGED AT NODES
S,
*END STEP