*HEADING
 NAFEMS TEST LE2, Cylindrical Shell Bending Patch Test  [SC8R]
*NODE
*NGEN,NSET=EDGEAB
*NGEN,NSET=EDGECD
*NGEN,NSET=EDGEAD
*NGEN,NSET=EDGEBC
*NGEN
*NSET,NSET=NALL,GEN
*NMAP,NSET=NALL,TYPE=CYLINDRICAL
*ELEMENT,TYPE=SC8R,ELSET=ALLELS
*ELGEN,ELSET=ALLELS
*MATERIAL,NAME=MAT
*ELASTIC,TYPE=ISOTROPIC
2.1E5,0.3
*SHELL SECTION,MATERIAL=MAT,ELSET=ALLELS
0.01,
*TRANSFORM,TYPE=C,NSET=NALL
*BOUNDARY
 EDGEAD,ZSYMM
 EDGEBC,ZSYMM
 EDGEAB,1,3
*RESTART,WRITE
*STEP
*STATIC
*CLOAD
  5,2,-12500.0
 15,2,-25000.0,
 25,2,-12500.0
105,2,+12500.0
115,2,+25000.0,
125,2,+12500.0
*OUTPUT, FIELD
*ELEMENT OUTPUT, POSITION=NODES
 S,
*END STEP