*HEADING
: NAFEMS TEST LE2, Cylindrical Shell Bending Patch Test  [SC8R]
*PREPRINT,ECHO=YES,HISTORY=NO,MODEL=NO
*NODE
*NGEN,NSET=EDGECD
*NGEN,NSET=EDGEBC
*NGEN,NSET=EDGEAB
*NGEN,NSET=EDGEAD1
*NSET,NSET=EDGEAD
*NSET,NSET=OUTER
 EDGECD,EDGEBC,EDGEAB,EDGEAD
*NGEN,NSET=INNER
*NSET,NSET=ALL
 INNER,OUTER
*NMAP,NSET=ALL,TYPE=CYLINDRICAL
*ELEMENT,TYPE=SC8R,ELSET=ALLELS
*MATERIAL,NAME=MAT
*ELASTIC,TYPE=ISOTROPIC
2.1E5,0.3
*SHELL SECTION,MATERIAL=MAT, ELSET=ALLELS
0.01,
*TRANSFORM,TYPE=C,NSET=ALL
*BOUNDARY
EDGEAB,1,3
EDGEAD,ZSYMM
EDGEBC,ZSYMM
*STEP,PERTURB
*STATIC
*CLOAD
 1,2,-0.125E5
 3,2,-0.25E5
 5,2,-0.125E5
 1001,2,+0.125E5
 1003,2,+0.25E5
 1005,2,+0.125E5
*OUTPUT, FIELD
*ELEMENT OUTPUT, POSITION=NODES
 S,
*END STEP