*HEADING
:NAFEMS FORCED VIBRATION; TEST 5H; [C3D15VH WITH 18 NODES]
*NODE
**
**
*ELEMENT, TYPE=C3D15VH, ELSET=EALL
**
*nset, nset=ends
**
*NSET, NSET=X0MID
*NSET, NSET=X10MID
*NSET, NSET=NMID
*ELSET,ELSET=EMID
**
*SOLID SECTION, ELSET=EALL, MATERIAL=MAT
*MATERIAL, NAME=MAT
*DENSITY
8000.,
*ELASTIC
200.E9,0.3
*DAMPING,ALPHA=5.36,BETA=7.46E-5
*BOUNDARY
ENDS,3,3
X0MID,1,2
X10MID,2,2
**
** HARMONIC LOAD
** -------------
**
*STEP,PERT
*STEADY STATE DYNAMICS,DIRECT,FREQUENCY SCALE = LINEAR
40.,45.,50,1
*DLOAD, OP=NEW
14,p3,-5.e5
15,p3,-5.e5
18,p3,-5.e5
19,p3,-5.e5
22,p3,-5.e5
23,p3,-5.e5
*NODE PRINT,NSET=NMID,FRE=24
U2,
*EL PRINT,FRE=24,ELSET=EMID, FREQ=1
S,
*NODE FILE,NSET=NMID
U,
*OUTPUT,FIELD
*NODE OUTPUT,NSET=NMID
U,
*EL FILE,FRE=24,POSITION=AVERAGED AT NODES,ELSET=EMID
S,
*ENDSTEP