*HEADING
:NAFEMS FORCED VIBRATION; TEST 5H; [C3D10]
*NODE
**
**
*ELEMENT, TYPE=C3D10, ELSET=EALL
**
*NSET, NSET=ENDS
*NSET, NSET=X0MID
*NSET, NSET=X10MID
*NSET, NSET=NMID
*ELSET,ELSET=EMID
**
*SOLID SECTION, ELSET=EALL, MATERIAL=MAT
*MATERIAL, NAME=MAT
*DENSITY
8000.,
*ELASTIC
200.E9,0.3
*DAMPING,ALPHA=5.36,BETA=7.46E-5
*BOUNDARY
ENDS,3,3
X0MID,1,2
X10MID,2,2
**
**
** HARMONIC LOAD
** -------------
**
*STEP,PERT
*STEADY STATE DYNAMICS,DIRECT,FREQUENCY SCALE = LINEAR
40.,45.,50,1
*DLOAD
      26, P2,    -500000.
      29, P2,    -500000.
      32, P4,    -500000.
      33, P4,    -500000.
      36, P2,    -500000.
      39, P2,    -500000.
      42, P4,    -500000.
      43, P4,    -500000.
      46, P2,    -500000.
      49, P2,    -500000.
*NODE PRINT,NSET=NMID,FRE=14
U2,
*EL PRINT,FRE=25,POSITION=AVERAGED AT NODES,ELSET=EMID
S,
*NODE FILE,NSET=NMID
U,
*OUTPUT,FIELD
*NODE OUTPUT,NSET=NMID
U,
*EL FILE,FRE=14,POSITION=AVERAGED AT NODES,ELSET=EMID
S,
*ENDSTEP