*HEADING
RATE DEPENDENT MISES PLASTICITY, UNIAXIAL TENSION TEST, C3D8
**TESTING FOR TEMPERATURE DEPENDENCIES
*NODE,NSET=ALLN
*ELEMENT,TYPE=C3D8,ELSET=ALLE
*SOLID SECTION,ELSET=ALLE,MATERIAL=ALLE
*MATERIAL,NAME=ALLE
*ELASTIC
200.E3,.3
*PLASTIC
200.,0.
220.,.0009
220.,.0029
*RATE DEPENDENT,TYPE=YIELD RATIO
**
*INITIAL CONDITIONS, TYPE=TEMPERATURE
ALLN, 15.0
*BOUNDARY
1,PINNED
2,2
5,2
6,2
4,1
5,1
8,1
2,3
3,3
*STEP,INC=20
*STATIC,DIRECT
1.E-3,20.E-3
*BOUNDARY
7,3,,.004
5,3,,.004
6,3,,.004
8,3,,.004
*EL PRINT
S,
SINV,
E,
PE,
EE,
*NODE PRINT
U,RF
*EL FILE,FREQ=10
S,E,PE
*END STEP