*HEADING
le2_s4rsw_c: NAFEMS TEST LE2, Cylindrical Shell Bending Patch Test  [S4RSW]
*NODE
*NGEN,NSET=EDGEAB
*NGEN,NSET=EDGECD
*NGEN,NSET=EDGEAD
*NGEN,NSET=EDGEBC
*NGEN
*NSET,NSET=NALL,GEN
*NMAP,NSET=NALL,TYPE=CYLINDRICAL
*ELEMENT,TYPE=S4RSW,ELSET=ALLELS
*ELGEN,ELSET=ALLELS
*ELSET,ELSET=HIST
*MATERIAL,NAME=MAT
*ELASTIC,TYPE=ISOTROPIC
210.E9,0.3
*DENSITY
7800.,
*SHELL SECTION, MATERIAL=MAT,ELSET=ALLELS
0.01,
*TRANSFORM,TYPE=C,NSET=NALL
*AMPLITUDE,NAME=RAMP
0.0,0.0,.25,1.0
*BOUNDARY
 EDGEAD,ZSYMM
 EDGEBC,ZSYMM
 EDGEAB,1,6
*RESTART,TIMEMARKS=NO,WRITE,NUM=10
*STEP
*DYNAMIC,EXPLICIT
,.25
*CLOAD,AMP=RAMP
5,6,125.0
15,6,250.0,
25,6,125.0
***OUTPUT,HISTORY,TIME INTERVAL=.005
***ELEMENT OUTPUT,ELSET=HIST,SECTIONPOINT=5
**S,
*OUTPUT,FIELD,VAR=PRESELECT,NUMBER INTERVAL=5
**
** Output requests for qa testing
**
*NSET, NSET=QA_TEST
*OUTPUT,FIELD,NUMBER INTERVAL=1
*NODE OUTPUT, NSET=QA_TEST
U,
*OUTPUT,HISTORY,VAR=PRESELECT,TIME INTERVAL=0.025
*FILE OUTPUT,NUM=1
*NODE FILE, NSET=QA_TEST
U,
*ENERGY FILE
*END STEP