*HEADING
le2_s3r_c: NAFEMS Test LE2, Cylindrical Shell Bending Patch Test  [S3R]
*NODE
*NGEN,NSET=EDGEAB
*NGEN,NSET=EDGECD
*NGEN,NSET=EDGEAD
*NGEN,NSET=EDGEBC
*NGEN
*NSET,NSET=NALL,GEN
*NMAP,NSET=NALL,TYPE=CYLINDRICAL
*ELEMENT,TYPE=S3R,ELSET=ALLELS
*ELGEN,ELSET=ALLELS
*ELSET,ELSET=HIST
*MATERIAL,NAME=MAT
*ELASTIC,TYPE=ISOTROPIC
210.E9,0.3
*DENSITY
7800.,
*SHELL SECTION, MATERIAL=MAT,ELSET=ALLELS
0.01,
*TRANSFORM,TYPE=C,NSET=NALL
*BOUNDARY
 EDGEAD,ZSYMM
 EDGEBC,ZSYMM
 EDGEAB,1,6
*AMPLITUDE,NAME=RAMP
0.0,0.0,0.25,1.0
*RESTART,TIMEMARKS=NO,WRITE,NUM=10
*NSET, NSET=CHECK
*NSET,NSET=QA_TEST_CHECK
CHECK,
**
*STEP
*DYNAMIC,EXPLICIT
,0.25
*CLOAD,AMP=RAMP
5,6,125.0
15,6,250.0
25,6,125.0
***OUTPUT,HISTORY,TIME INTERVAL=.005
***ELEMENT OUTPUT,ELSET=HIST,SECTIONPOINT=5
**S,
*FILE OUTPUT,TIMEMARKS=YES,NUM=1
*NODE FILE, NSET=CHECK
U,
*ENERGY FILE
*OUTPUT, FIELD, TIMEMARKS=YES, NUMBER INTERVAL=1
*NODE OUTPUT, NSET=QA_TEST_CHECK
U,
*OUTPUT,FIELD,VARIABLE=PRESELECT
*OUTPUT,HISTORY,VARIABLE=PRESELECT,TIMEINT=0.25
*END STEP