*Heading
 First Lift then load
** Job name: LCA-FullModel-LoadCase2 Model name: LCA-FullModel-LC2
*Preprint, echo=NO, model=NO, history=NO, contact=NO
**
** PARTS
**
*Part, name=FB-InnerRubber
*Node
*Element, type=C3D8
*Nset, nset=_PICKEDSET6, internal, generate
*Elset, elset=_PICKEDSET6, internal, generate
*Elset, elset=_SURF-1_S4, internal
*Elset, elset=_SURF-1_S6, internal
*Elset, elset=_SURF-2_S4, internal
*Elset, elset=_SURF-2_S6, internal
*Elset, elset=_PickedSet10, internal, generate
*Elset, elset=_SURF-1_S4, internal
*Elset, elset=_SURF-1_S6, internal
*Surface, type=ELEMENT, name=SURF-1
_SURF-1_S4, S4
_SURF-1_S6, S6
*Elset, elset=_SURF-2_S6, internal
*Elset, elset=_SURF-2_S4, internal
*Surface, type=ELEMENT, name=SURF-2
_SURF-2_S6, S6
_SURF-2_S4, S4
** Region: (FB-InnerRubber:Picked), (Controls:EC-1)
*Elset, elset=_PickedSet10, internal, generate
** Section: FB-InnerRubber
*Solid Section, elset=_PickedSet10, controls=EC-1, material=FB-Rubber
1.,
*End Part
**
*Part, name=FB-InnerTube
*Node
*Element, type=C3D8
*Nset, nset=_PICKEDSET6, internal, generate
*Elset, elset=_PICKEDSET6, internal, generate
*Elset, elset=_SURF-1_S4, internal
*Elset, elset=_SURF-1_S6, internal
*Elset, elset=_SURF-2_S4, internal
*Elset, elset=_SURF-2_S6, internal
*Elset, elset=_PickedSet10, internal, generate
*Elset, elset=_SURF-1_S6, internal
*Elset, elset=_SURF-1_S4, internal
*Surface, type=ELEMENT, name=SURF-1
_SURF-1_S6, S6
_SURF-1_S4, S4
*Elset, elset=_SURF-2_S4, internal
*Elset, elset=_SURF-2_S6, internal
*Surface, type=ELEMENT, name=SURF-2
_SURF-2_S4, S4
_SURF-2_S6, S6
** Region: (FB-InnerTube:Picked), (Controls:Default)
*Elset, elset=_PickedSet10, internal, generate
** Section: FB-InnerTube
*Solid Section, elset=_PickedSet10, material=FB-Steel
1.,
*End Part
**
*Part, name=FB-MiddleTube
*Node
*Element, type=C3D8
*Nset, nset=_PICKEDSET5, internal, generate
*Elset, elset=_PICKEDSET5, internal, generate
*Elset, elset=_SURF-1_S4, internal
*Elset, elset=_SURF-1_S6, internal
*Elset, elset=_SURF-2_S4, internal
*Elset, elset=_SURF-2_S6, internal
*Elset, elset=_PickedSet10, internal, generate
*Elset, elset=_SURF-1_S4, internal
*Elset, elset=_SURF-1_S6, internal
*Surface, type=ELEMENT, name=SURF-1
_SURF-1_S4, S4
_SURF-1_S6, S6
*Elset, elset=_SURF-2_S6, internal
*Elset, elset=_SURF-2_S4, internal
*Surface, type=ELEMENT, name=SURF-2
_SURF-2_S6, S6
_SURF-2_S4, S4
** Region: (FB-MiddleTube:Picked), (Controls:Default)
*Elset, elset=_PickedSet10, internal, generate
** Section: FB-MiddleTube
*Solid Section, elset=_PickedSet10, material=FB-Steel
1.,
*End Part
**
*Part, name=FB-OuterRubber
*Node
*Element, type=C3D8
*Nset, nset=_PICKEDSET6, internal, generate
*Elset, elset=_PICKEDSET6, internal, generate
*Elset, elset=_SURF-1_S4, internal
*Elset, elset=_SURF-1_S6, internal
*Elset, elset=_SURF-2_S4, internal
*Elset, elset=_SURF-2_S6, internal
*Elset, elset=_PickedSet10, internal, generate
*Elset, elset=_SURF-1_S4, internal
*Elset, elset=_SURF-1_S6, internal
*Surface, type=ELEMENT, name=SURF-1
_SURF-1_S4, S4
_SURF-1_S6, S6
*Elset, elset=_SURF-2_S6, internal
*Elset, elset=_SURF-2_S4, internal
*Surface, type=ELEMENT, name=SURF-2
_SURF-2_S6, S6
_SURF-2_S4, S4
** Region: (FB-OuterRubber:Picked), (Controls:EC-1)
*Elset, elset=_PickedSet10, internal, generate
** Section: FB-OuterRubber
*Solid Section, elset=_PickedSet10, controls=EC-1, material=FB-Rubber
1.,
*End Part
**
*Part, name=FB-OuterTube
*Node
*Element, type=C3D8
*Nset, nset=_PICKEDSET6, internal, generate
*Elset, elset=_PICKEDSET6, internal, generate
*Elset, elset=_SURF-1_S4, internal
*Elset, elset=_SURF-1_S6, internal
*Elset, elset=_SURF-2_S4, internal
*Elset, elset=_SURF-2_S6, internal
*Elset, elset=_PickedSet10, internal, generate
*Elset, elset=_SURF-1_S6, internal
*Elset, elset=_SURF-1_S4, internal
*Surface, type=ELEMENT, name=SURF-1
_SURF-1_S6, S6
_SURF-1_S4, S4
*Elset, elset=_SURF-2_S4, internal
*Elset, elset=_SURF-2_S6, internal
*Surface, type=ELEMENT, name=SURF-2
_SURF-2_S4, S4
_SURF-2_S6, S6
** Region: (FB-OuterTube:Picked), (Controls:Default)
*Elset, elset=_PickedSet10, internal, generate
** Section: FB-OuterTube
*Solid Section, elset=_PickedSet10, material=FB-Steel
1.,
*End Part
**
*Part, name=INNERTUBE-1
*Node
*Element, type=C3D8
*Nset, nset=_PICKEDSET2, internal, generate
*Elset, elset=_PICKEDSET2, internal, generate
*Nset, nset=_PICKEDSET3, internal, generate
*Elset, elset=_PICKEDSET3, internal, generate
** Region: (Section-ASSEMBLY_INNERTUBE-1__PICKEDSET3:Picked), (Controls:EC-1)
*Elset, elset=_PICKEDSET3, internal, generate
** Section: Section-ASSEMBLY_INNERTUBE-1__PICKEDSET3
*Solid Section, elset=_PICKEDSET3, controls=EC-1, material=STEEL
1.,
*End Part
**
*Part, name=LCA
*End Part
**
*Part, name=OUTERTUBE-1
*Node
*Element, type=C3D8
*Nset, nset=_PICKEDSET2, internal, generate
*Elset, elset=_PICKEDSET2, internal, generate
*Nset, nset=_PICKEDSET3, internal, generate
*Elset, elset=_PICKEDSET3, internal, generate
** Region: (Section-ASSEMBLY_OUTERTUBE-1__PICKEDSET3:Picked), (Controls:EC-1)
*Elset, elset=_PICKEDSET3, internal, generate
** Section: Section-ASSEMBLY_OUTERTUBE-1__PICKEDSET3
*Solid Section, elset=_PICKEDSET3, controls=EC-1, material=STEEL
1.,
*End Part
**
*Part, name=RUBBER-1
*Node
*Element, type=C3D8
*Nset, nset=_PICKEDSET20, internal, generate
*Elset, elset=_PICKEDSET20, internal, generate
*Elset, elset=_SURF-1_S3, internal
*Elset, elset=_SURF-1_S4, internal
*Elset, elset=_SURF-1_S5, internal
*Elset, elset=_SURF-1_S6, internal
*Elset, elset=_SURF-2_S4, internal
*Elset, elset=_SURF-2_S5, internal
*Elset, elset=_SURF-3_S3, internal
*Elset, elset=_SURF-3_S4, internal
*Elset, elset=_SURF-3_S5, internal
*Elset, elset=_SURF-3_S6, internal
*Elset, elset=_SURF-4_S3, internal
*Elset, elset=_SURF-4_S4, internal
*Elset, elset=_SURF-4_S5, internal
*Elset, elset=_SURF-4_S6, internal
*Elset, elset=_SURF-1_S6, internal
*Elset, elset=_SURF-1_S3, internal
*Elset, elset=_SURF-1_S4, internal
*Elset, elset=_SURF-1_S5, internal
*Surface, type=ELEMENT, name=SURF-1
_SURF-1_S6, S6
_SURF-1_S3, S3
_SURF-1_S4, S4
_SURF-1_S5, S5
*Elset, elset=_SURF-2_S4, internal
*Elset, elset=_SURF-2_S5, internal
*Surface, type=ELEMENT, name=SURF-2
_SURF-2_S4, S4
_SURF-2_S5, S5
*Elset, elset=_SURF-3_S4, internal
*Elset, elset=_SURF-3_S3, internal
*Elset, elset=_SURF-3_S6, internal
*Elset, elset=_SURF-3_S5, internal
*Surface, type=ELEMENT, name=SURF-3
_SURF-3_S4, S4
_SURF-3_S3, S3
_SURF-3_S6, S6
_SURF-3_S5, S5
*Elset, elset=_SURF-4_S5, internal
*Elset, elset=_SURF-4_S4, internal
*Elset, elset=_SURF-4_S3, internal
*Elset, elset=_SURF-4_S6, internal
*Surface, type=ELEMENT, name=SURF-4
_SURF-4_S5, S5
_SURF-4_S4, S4
_SURF-4_S6, S6
_SURF-4_S3, S3
** Region: (Section-ASSEMBLY_RUBBER-1__PICKEDSET20:Picked), (Controls:EC-1)
*Elset, elset=_PICKEDSET20, internal, generate
** Section: Section-ASSEMBLY_RUBBER-1__PICKEDSET20
*Solid Section, elset=_PICKEDSET20, controls=EC-1, material=RUBBER
1.,
*End Part
**
*Part, name=U_Bracket_w_connections
*End Part
**
**
** ASSEMBLY
**
*Assembly, name=Assembly
**
*Instance, name=LCA-1, part=LCA
*Node
*Element, type=S4R
*Nset, nset=_PickedSet3, internal, generate
*Elset, elset=_PickedSet3, internal, generate
** Region: (LCA:Picked)
*Elset, elset=_PickedSet3, internal, generate
** Section: LCA
*Shell Section, elset=_PickedSet3, material=STEEL
3., 5
*End Instance
**
*Instance, name=U_Bracket_w_connections-1, part=U_Bracket_w_connections
*Node
*Element, type=C3D8R
*Node
*Nset, nset=U_Bracket_w_connections-1-RefPt_, internal
*Nset, nset=_PickedSet6, internal, generate
*Elset, elset=_PickedSet6, internal, generate
** Region: (U-Bracket:Picked)
*Elset, elset=_PickedSet6, internal, generate
** Section: U-Bracket
*Solid Section, elset=_PickedSet6, material=STEEL
1.,
*End Instance
**
*Instance, name=INNERTUBE-1-1, part=INNERTUBE-1
*End Instance
**
*Instance, name=OUTERTUBE-1-1, part=OUTERTUBE-1
*End Instance
**
*Instance, name=RUBBER-1-1, part=RUBBER-1
*End Instance
**
*Instance, name=FB-InnerRubber-1, part=FB-InnerRubber
*End Instance
**
*Instance, name=FB-InnerTube-1, part=FB-InnerTube
*End Instance
**
*Instance, name=FB-MiddleTube-1, part=FB-MiddleTube
*End Instance
**
*Instance, name=FB-OuterRubber-1, part=FB-OuterRubber
*End Instance
**
*Instance, name=FB-OuterTube-1, part=FB-OuterTube
*End Instance
**
*Node
*Node
*Node
*Nset, nset=_PickedSet160, internal, instance=U_Bracket_w_connections-1
*Nset, nset=_PickedSet161, internal, instance=U_Bracket_w_connections-1, generate
*Elset, elset=_PickedSet161, internal, instance=U_Bracket_w_connections-1, generate
*Nset, nset=LCA-BallJoint
*Nset, nset=LCA-RearBushing
*Nset, nset=RB-ICYL
*Nset, nset=RB-OCYL
*Nset, nset=FB-ICYL
*Nset, nset=U_Bracket_RP, instance=U_Bracket_w_connections-1
*Nset, nset=FB-OCYL
*Nset, nset=LCA-FrontBushing
*Elset, elset=__PickedSurf168_SPOS, internal, instance=LCA-1, generate
*Surface, type=ELEMENT, name=_PickedSurf168, internal
__PickedSurf168_SPOS, SPOS
*Elset, elset=__PickedSurf175_SPOS, internal, instance=LCA-1
*Surface, type=ELEMENT, name=_PickedSurf175, internal
__PickedSurf175_SPOS, SPOS
*Elset, elset=__PickedSurf176_SPOS, internal, instance=LCA-1, generate
*Surface, type=ELEMENT, name=_PickedSurf176, internal
__PickedSurf176_SPOS, SPOS
*Elset, elset=_RB-InnerTubeInside_S4, internal, instance=INNERTUBE-1-1
*Elset, elset=_RB-InnerTubeInside_S6, internal, instance=INNERTUBE-1-1
*Surface, type=ELEMENT, name=RB-InnerTubeInside
_RB-InnerTubeInside_S4, S4
_RB-InnerTubeInside_S6, S6
*Elset, elset=_RB-InnerTubeOutside_S4, internal, instance=INNERTUBE-1-1
*Elset, elset=_RB-InnerTubeOutside_S6, internal, instance=INNERTUBE-1-1
*Surface, type=ELEMENT, name=RB-InnerTubeOutside
_RB-InnerTubeOutside_S4, S4
_RB-InnerTubeOutside_S6, S6
*Elset, elset=_RB-OuterTubeInside_S4, internal, instance=OUTERTUBE-1-1
*Elset, elset=_RB-OuterTubeInside_S6, internal, instance=OUTERTUBE-1-1
*Surface, type=ELEMENT, name=RB-OuterTubeInside
_RB-OuterTubeInside_S4, S4
_RB-OuterTubeInside_S6, S6
*Elset, elset=_RB-OuterTubeOutside_S4, internal, instance=OUTERTUBE-1-1
*Elset, elset=_RB-OuterTubeOutside_S6, internal, instance=OUTERTUBE-1-1
*Surface, type=ELEMENT, name=RB-OuterTubeOutside
_RB-OuterTubeOutside_S4, S4
_RB-OuterTubeOutside_S6, S6
*Elset, elset=_FB-InnerTubeInside_S4, internal, instance=FB-InnerTube-1
*Elset, elset=_FB-InnerTubeInside_S6, internal, instance=FB-InnerTube-1
*Surface, type=ELEMENT, name=FB-InnerTubeInside
_FB-InnerTubeInside_S4, S4
_FB-InnerTubeInside_S6, S6
*Elset, elset=_FB-InnerTubeOutside_S4, internal, instance=FB-InnerTube-1
*Elset, elset=_FB-InnerTubeOutside_S6, internal, instance=FB-InnerTube-1
*Surface, type=ELEMENT, name=FB-InnerTubeOutside
_FB-InnerTubeOutside_S4, S4
_FB-InnerTubeOutside_S6, S6
*Elset, elset=_FB-InnerRubberInside_S4, internal, instance=FB-InnerRubber-1
*Elset, elset=_FB-InnerRubberInside_S6, internal, instance=FB-InnerRubber-1
*Surface, type=ELEMENT, name=FB-InnerRubberInside
_FB-InnerRubberInside_S4, S4
_FB-InnerRubberInside_S6, S6
*Elset, elset=_FB-InnerRubberOutside_S4, internal, instance=FB-InnerRubber-1
*Elset, elset=_FB-InnerRubberOutside_S6, internal, instance=FB-InnerRubber-1
*Surface, type=ELEMENT, name=FB-InnerRubberOutside
_FB-InnerRubberOutside_S4, S4
_FB-InnerRubberOutside_S6, S6
*Elset, elset=_FB-MiddleTubeInside_S4, internal, instance=FB-MiddleTube-1
*Elset, elset=_FB-MiddleTubeInside_S6, internal, instance=FB-MiddleTube-1
*Surface, type=ELEMENT, name=FB-MiddleTubeInside
_FB-MiddleTubeInside_S4, S4
_FB-MiddleTubeInside_S6, S6
*Elset, elset=_FB-MiddleTubeOutside_S4, internal, instance=FB-MiddleTube-1
*Elset, elset=_FB-MiddleTubeOutside_S6, internal, instance=FB-MiddleTube-1
*Surface, type=ELEMENT, name=FB-MiddleTubeOutside
_FB-MiddleTubeOutside_S4, S4
_FB-MiddleTubeOutside_S6, S6
*Elset, elset=_FB-OuterRubberInside_S4, internal, instance=FB-OuterRubber-1
*Elset, elset=_FB-OuterRubberInside_S6, internal, instance=FB-OuterRubber-1
*Surface, type=ELEMENT, name=FB-OuterRubberInside
_FB-OuterRubberInside_S4, S4
_FB-OuterRubberInside_S6, S6
*Elset, elset=_FB-OuterRubberOutside_S4, internal, instance=FB-OuterRubber-1
*Elset, elset=_FB-OuterRubberOutside_S6, internal, instance=FB-OuterRubber-1
*Surface, type=ELEMENT, name=FB-OuterRubberOutside
_FB-OuterRubberOutside_S4, S4
_FB-OuterRubberOutside_S6, S6
*Elset, elset=_FB-OuterTubeInside_S4, internal, instance=FB-OuterTube-1
*Elset, elset=_FB-OuterTubeInside_S6, internal, instance=FB-OuterTube-1
*Surface, type=ELEMENT, name=FB-OuterTubeInside
_FB-OuterTubeInside_S4, S4
_FB-OuterTubeInside_S6, S6
*Elset, elset=_FB-OuterTubeOutside_S4, internal, instance=FB-OuterTube-1
*Elset, elset=_FB-OuterTubeOutside_S6, internal, instance=FB-OuterTube-1
*Surface, type=ELEMENT, name=FB-OuterTubeOutside
_FB-OuterTubeOutside_S4, S4
_FB-OuterTubeOutside_S6, S6
*Elset, elset=_RB-SelfContactLarge_S3, internal, instance=RUBBER-1-1
*Elset, elset=_RB-SelfContactLarge_S4, internal, instance=RUBBER-1-1
*Elset, elset=_RB-SelfContactLarge_S5, internal, instance=RUBBER-1-1
*Elset, elset=_RB-SelfContactLarge_S6, internal, instance=RUBBER-1-1
*Surface, type=ELEMENT, name=RB-SelfContactLarge
_RB-SelfContactLarge_S3, S3
_RB-SelfContactLarge_S4, S4
_RB-SelfContactLarge_S6, S6
_RB-SelfContactLarge_S5, S5
*Elset, elset=_RB-SelfContactSmall_S3, internal, instance=RUBBER-1-1
*Elset, elset=_RB-SelfContactSmall_S4, internal, instance=RUBBER-1-1
*Elset, elset=_RB-SelfContactSmall_S5, internal, instance=RUBBER-1-1
*Elset, elset=_RB-SelfContactSmall_S6, internal, instance=RUBBER-1-1
*Surface, type=ELEMENT, name=RB-SelfContactSmall
_RB-SelfContactSmall_S3, S3
_RB-SelfContactSmall_S4, S4
_RB-SelfContactSmall_S6, S6
_RB-SelfContactSmall_S5, S5
*Elset, elset=_RB-InnerSelfContactSmall_S3, internal, instance=RUBBER-1-1
*Elset, elset=_RB-InnerSelfContactSmall_S4, internal, instance=RUBBER-1-1, generate
*Elset, elset=_RB-InnerSelfContactSmall_S5, internal, instance=RUBBER-1-1
*Elset, elset=_RB-InnerSelfContactSmall_S6, internal, instance=RUBBER-1-1
*Surface, type=ELEMENT, name=RB-InnerSelfContactSmall
_RB-InnerSelfContactSmall_S3, S3
_RB-InnerSelfContactSmall_S4, S4
_RB-InnerSelfContactSmall_S6, S6
_RB-InnerSelfContactSmall_S5, S5
*Elset, elset=_RB-OuterSelfContactSmall_S4, internal, instance=RUBBER-1-1
*Elset, elset=_RB-OuterSelfContactSmall_S5, internal, instance=RUBBER-1-1
*Elset, elset=_RB-OuterSelfContactSmall_S6, internal, instance=RUBBER-1-1
*Surface, type=ELEMENT, name=RB-OuterSelfContactSmall
_RB-OuterSelfContactSmall_S4, S4
_RB-OuterSelfContactSmall_S5, S5
_RB-OuterSelfContactSmall_S6, S6
** Constraint: BallJoint
*Coupling, constraint name=BallJoint, ref node=LCA-BallJoint, surface=_PickedSurf168
*Distributing, weighting method=UNIFORM
** Constraint: FB-ICYL
*Coupling, constraint name=FB-ICYL, ref node=FB-ICYL, surface=FB-InnerTubeInside
*Distributing, weighting method=UNIFORM
** Constraint: FB-InnerRubberInside
*Tie, name=FB-InnerRubberInside, adjust=yes
FB-InnerTubeOutside, FB-InnerRubberInside
** Constraint: FB-InnerRubberOutside
*Tie, name=FB-InnerRubberOutside, adjust=yes
FB-MiddleTubeInside, FB-InnerRubberOutside
** Constraint: FB-OCYL
*Coupling, constraint name=FB-OCYL, ref node=FB-OCYL, surface=FB-OuterTubeOutside
*Distributing, weighting method=UNIFORM
** Constraint: FB-OuterRubberInside
*Tie, name=FB-OuterRubberInside, adjust=yes
FB-MiddleTubeOutside, FB-OuterRubberInside
** Constraint: FB-OuterRubberOutside
*Tie, name=FB-OuterRubberOutside, adjust=yes
FB-OuterTubeInside, FB-OuterRubberOutside
** Constraint: LCA-FB
*Coupling, constraint name=LCA-FB, ref node=LCA-FrontBushing, surface=_PickedSurf176
*Distributing, weighting method=UNIFORM
** Constraint: LCA-RB
*Coupling, constraint name=LCA-RB, ref node=LCA-RearBushing, surface=_PickedSurf175
*Distributing, weighting method=UNIFORM
** Constraint: RB-ICYL
*Coupling, constraint name=RB-ICYL, ref node=RB-ICYL, surface=RB-InnerTubeInside
*Distributing, weighting method=UNIFORM
** Constraint: RB-RubberInside
*Tie, name=RB-RubberInside, adjust=yes
RUBBER-1-1.SURF-1, RB-InnerTubeOutside
** Constraint: RB-RubberOutside
*Tie, name=RB-RubberOutside, adjust=yes
RUBBER-1-1.SURF-2, RB-OuterTubeInside
** Constraint: RB_OCYL
*Coupling, constraint name=RB_OCYL, ref node=RB-OCYL, surface=RB-OuterTubeOutside
*Distributing, weighting method=UNIFORM
** Constraint: U_Bracket-RigidBody
*Rigid Body, ref node=_PickedSet160, elset=_PickedSet161
**
** CONNECTORS
**
*Element, type=CONN3D2, elset=_FB-ICYL-Ubracket_CnSet_
1, U_Bracket_w_connections-1.1498, 6
*Connector Section, elset=_FB-ICYL-Ubracket_CnSet_
Beam,
*Element, type=CONN3D2, elset=_FB-LCA-OCYL_CnSet_
*Connector Section, elset=_FB-LCA-OCYL_CnSet_
Beam,
*Element, type=CONN3D2, elset=_RB-LCA-OCYL_CnSet_
*Connector Section, elset=_RB-LCA-OCYL_CnSet_
Beam,
*End Assembly
**
** ELEMENT CONTROLS
**
*Section Controls, name=EC-1, hourglass=RELAX STIFFNESS
**
** MATERIALS
**
*Material, name=FB-Rubber
*Hyperelastic, n=2, ogden
 0.167099,     9.00665, 2.15372e-05,     -4.8694,         0.1,         0.1
*Material, name=FB-Steel
*Elastic
210000., 0.3
*Material, name=RUBBER
*Hyperelastic, n=2, ogden
 1.67099,     9.00665, 0.000215372,     -4.8694,          1.,          1.
*Material, name=STEEL
*Elastic
210000., 0.3
**
** INTERACTION PROPERTIES
**
*Surface Interaction, name=IntProp-1
1.,
**
** BOUNDARY CONDITIONS
**
** Name: FixUBracket Type: Symmetry/Antisymmetry/Encastre
*Boundary
U_Bracket_RP, ENCASTRE
** Name: RB-ICYL Type: Symmetry/Antisymmetry/Encastre
*Boundary
RB-ICYL, ENCASTRE
**
** INTERACTIONS
**
** Interaction: RB-SelfLarge
*Contact Pair, interaction=IntProp-1,type=surface
RB-SelfContactLarge,
** Interaction: RB-SelfSmall
*Contact Pair, interaction=IntProp-1,type=surface
RB-InnerSelfContactSmall, RB-OuterSelfContactSmall
** ----------------------------------------------------------------
**
** STEP: Step-1
**
*Step, name=Step-1, nlgeom=YES
Lifting of LCA to 10 degrees angle about 1 axis
*Static
0.1, 1., 1e-05, 1.
**
** BOUNDARY CONDITIONS
**
** Name: Lift-LCA Type: Displacement/Rotation
*Boundary
LCA-BallJoint, 3, 3, -60.
**
** OUTPUT REQUESTS
**
** FIELD OUTPUT: F-Output-1
**
*Output, field, frequency=99999
*Node Output
U,
**
** HISTORY OUTPUT: H-Output-2
**
*Output, history
*Node Output, nset=LCA-BallJoint
U1, U2, U3, UR1, UR2, UR3
**
** HISTORY OUTPUT: H-Output-3
**
*Node Output, nset=RB-ICYL
RF1, RF2, RF3, RM1, RM2, RM3, U1, U2
U3, UR1, UR2, UR3
**
** HISTORY OUTPUT: H-Output-4
**
*Node Output, nset=U_Bracket_RP
RF1, RF2, RF3, RM1, RM2, RM3, U1, U2
U3, UR1, UR2, UR3
*End Step
** ----------------------------------------------------------------
**
** STEP: Step-2
**
*Step, name=Step-2, nlgeom=YES
Loading in -1 direction 900 N
*Static
0.1, 1.
**
** LOADS
**
** Name: BallJoint_LoadCase1   Type: Concentrated force
*Cload
LCA-BallJoint, 1, -900.
*print, contact=yes
*End Step
** ----------------------------------------------------------------
**
** STEP: Step-3
**
*Step, name=Step-3, nlgeom=YES, unsymm=YES
Loading in -1 direction 1000 N
*Static
0.1, 1.
**
** LOADS
**
** Name: BallJoint_LoadCase1   Type: Concentrated force
*Cload
LCA-BallJoint, 1, -1000.
*print, contact=yes
*End Step