*Heading
 First Lift then load LCA -- Load case 2
** Job name: LCA-BushingConn-LC2 Model name: LCA-BushingConnectors-LC2
*Preprint, echo=NO, model=NO, history=NO, contact=NO
**
** PARTS
**
*Part, name=LCA
*End Part
**
*Part, name=U_Bracket_w_connections
*End Part
**
**
** ASSEMBLY
**
*Assembly, name=Assembly
**
*Instance, name=LCA-1, part=LCA
*Node
*Element, type=S4R
*Nset, nset=_PickedSet3, internal, generate
*Elset, elset=_PickedSet3, internal, generate
** Region: (LCA:Picked)
*Elset, elset=_PickedSet3, internal, generate
** Section: LCA
*Shell Section, elset=_PickedSet3, material=STEEL
3., 5
*End Instance
**
*Instance, name=U_Bracket_w_connections-1, part=U_Bracket_w_connections
*Node
*Element, type=C3D8R
*Node
*Nset, nset=U_Bracket_w_connections-1-RefPt_, internal
*Nset, nset=_PickedSet6, internal, generate
*Elset, elset=_PickedSet6, internal, generate
** Region: (U-Bracket:Picked)
*Elset, elset=_PickedSet6, internal, generate
** Section: U-Bracket
*Solid Section, elset=_PickedSet6, material=STEEL
1.,
*End Instance
**
*Node
*Node
*Node
*Nset, nset=_PickedSet160, internal, instance=U_Bracket_w_connections-1
*Nset, nset=_PickedSet161, internal, instance=U_Bracket_w_connections-1, generate
*Elset, elset=_PickedSet161, internal, instance=U_Bracket_w_connections-1, generate
*Nset, nset=LCA-BallJoint
*Nset, nset=LCA-RearBushing
*Nset, nset=U_Bracket_RP, instance=U_Bracket_w_connections-1
*Nset, nset=LCA-FrontBushing
*Nset, nset=_PickedSet329, internal
*Nset, nset=RB-Fixed
*Elset, elset=__PickedSurf168_SPOS, internal, instance=LCA-1, generate
*Surface, type=ELEMENT, name=_PickedSurf168, internal
__PickedSurf168_SPOS, SPOS
*Elset, elset=__PickedSurf175_SPOS, internal, instance=LCA-1
*Surface, type=ELEMENT, name=_PickedSurf175, internal
__PickedSurf175_SPOS, SPOS
*Elset, elset=__PickedSurf176_SPOS, internal, instance=LCA-1, generate
*Surface, type=ELEMENT, name=_PickedSurf176, internal
__PickedSurf176_SPOS, SPOS
*Orientation, name=FB-CSYS-1
*Orientation, name=FB-CSYS-2
*Orientation, name=RB-CSYS-1
*Orientation, name=RB-CSYS-2
** Constraint: BallJoint
*Coupling, constraint name=BallJoint, ref node=LCA-BallJoint, surface=_PickedSurf168
*Distributing, weighting method=UNIFORM
** Constraint: LCA-FB
*Coupling, constraint name=LCA-FB, ref node=LCA-FrontBushing, surface=_PickedSurf176
*Distributing, weighting method=UNIFORM
** Constraint: LCA-RB
*Coupling, constraint name=LCA-RB, ref node=LCA-RearBushing, surface=_PickedSurf175
*Distributing, weighting method=UNIFORM
** Constraint: U_Bracket-RigidBody
*Rigid Body, ref node=_PickedSet160, elset=_PickedSet161
**
** CONNECTORS
**
*Element, type=CONN3D2, elset=_FrontBushing_CnSet_
1, 4, U_Bracket_w_connections-1.1498
*Connector Section, elset=_FrontBushing_CnSet_, behavior=FrontBushing
Bushing,
FB-CSYS-1, FB-CSYS-2
*Element, type=CONN3D2, elset=_RearBushing_CnSet_
*Connector Section, elset=_RearBushing_CnSet_, behavior=RearBushing
Bushing,
RB-CSYS-1, RB-CSYS-2
*End Assembly
**
** MATERIALS
**
*Material, name=FB-Rubber
*Hyperelastic, n=2, ogden
 0.167099,     9.00665, 2.15372e-05,     -4.8694,         0.1,         0.1
*Material, name=FB-Steel
*Elastic
210000., 0.3
*Material, name=RUBBER
*Hyperelastic, n=2, ogden
 1.67099,     9.00665, 0.000215372,     -4.8694,          1.,          1.
*Material, name=STEEL
*Elastic
210000., 0.3
*Connector Behavior, name=FrontBushing
*Connector Elasticity, nonlinear, component=1
*Connector Elasticity, nonlinear, component=2
*Connector Elasticity, nonlinear, component=3
*Connector Elasticity, nonlinear, component=4
*Connector Elasticity, nonlinear, component=6
*Connector Elasticity, nonlinear, component=5, independent components=CONSTITUTIVE MOTION
*Connector Behavior, name=RearBushing
*Connector Elasticity, nonlinear, component=2
*Connector Elasticity, nonlinear, component=3
*Connector Elasticity, nonlinear, component=4
*Connector Elasticity, nonlinear, component=5
*Connector Elasticity, nonlinear, component=6
*Connector Elasticity, nonlinear, component=1, independent components=CONSTITUTIVE MOTION
**
** BOUNDARY CONDITIONS
**
** Name: FixRearBushing Type: Symmetry/Antisymmetry/Encastre
*Boundary
_PickedSet329, ENCASTRE
** Name: FixUBracket Type: Symmetry/Antisymmetry/Encastre
*Boundary
U_Bracket_RP, ENCASTRE
** ----------------------------------------------------------------
**
** STEP: Step-1
**
*Step, name=Step-1, nlgeom=YES
Lift LCA by 10 degrees about 1 axis
*Static
0.1, 1., 1e-05, 1.
**
** BOUNDARY CONDITIONS
**
** Name: LC1-BallJoint Type: Displacement/Rotation
*Boundary
LCA-BallJoint, 3, 3, -60.
**
** OUTPUT REQUESTS
**
*Restart, write, frequency=0
**
** FIELD OUTPUT: F-Output-1
**
*Output, field, frequency=99999
*Node Output
U,
**
** HISTORY OUTPUT: H-Output-3
**
*Output, history
*Element Output, elset=_FrontBushing_CnSet_
CTF1, CTF2, CTF3, CTM1, CTM2, CTM3, CU1, CU2, CU3, CUR1, CUR2, CUR3
**
** HISTORY OUTPUT: H-Output-4
**
*Element Output, elset=_RearBushing_CnSet_
CTF1, CTF2, CTF3, CTM1, CTM2, CTM3, CU1, CU2, CU3, CUR1, CUR2, CUR3
**
** HISTORY OUTPUT: H-Output-2
**
*Node Output, nset=LCA-BallJoint
U1, U2, U3, UR1, UR2, UR3
**
** HISTORY OUTPUT: H-Output-6
**
*Node Output, nset=RB-Fixed
RF1, RF2, RF3, RM1, RM2, RM3
**
** HISTORY OUTPUT: H-Output-5
**
*Node Output, nset=U_Bracket_RP
RF1, RF2, RF3, RM1, RM2, RM3
*End Step
** ----------------------------------------------------------------
**
** STEP: Step-2
**
*Step, name=Step-2, nlgeom=YES
Load Ball Joint in -1 direction 1000 N
*Static
0.1, 1., 1e-05, 1.
**
** LOADS
**
** Name: BallJoint_LoadCase1   Type: Concentrated force
*Cload
LCA-BallJoint, 1, -1000.
**
** OUTPUT REQUESTS
**
*Restart, write, frequency=0
**
** FIELD OUTPUT: F-Output-1
**
*Output, field, frequency=99999
*Node Output
U,
**
** HISTORY OUTPUT: H-Output-3
**
*Output, history
*Element Output, elset=_FrontBushing_CnSet_
CTF1, CTF2, CTF3, CTM1, CTM2, CTM3, CU1, CU2, CU3, CUR1, CUR2, CUR3
**
** HISTORY OUTPUT: H-Output-4
**
*Element Output, elset=_RearBushing_CnSet_
CTF1, CTF2, CTF3, CTM1, CTM2, CTM3, CU1, CU2, CU3, CUR1, CUR2, CUR3
**
** HISTORY OUTPUT: H-Output-2
**
*Node Output, nset=LCA-BallJoint
U1, U2, U3, UR1, UR2, UR3
**
** HISTORY OUTPUT: H-Output-6
**
*Node Output, nset=RB-Fixed
RF1, RF2, RF3, RM1, RM2, RM3
**
** HISTORY OUTPUT: H-Output-5
**
*Node Output, nset=U_Bracket_RP
RF1, RF2, RF3, RM1, RM2, RM3
*End Step