*HEADING
 TEST OF *IMPERFECTION, IMPERFECTION DEFINED BY SPHERICAL PERTURBATION VALUES
 TEST 9-DIGIT LABELS
*PREPRINT,ECHO=YES,HIST=YES,MODEL=YES
*NODE, NSET=QA_TEST_ALLNODES
*NGEN, LINE=C, NSET=BASE
*NGEN, LINE=C, NSET=TOP
*NFILL,NSET=NALL
 BASE,TOP,6,100
*NSET,NSET=EDGE1,GENERATE
*NSET,NSET=EDGE2,GENERATE
*IMPERFECTION, SYSTEM=S
*ELEMENT, TYPE=S4R
*ELGEN, ELSET=EALL
*SHELL SECTION, ELSET=EALL, MATERIAL=MAT
 .1,
*TRANSFORM,TYPE=C, NSET=NALL
*MATERIAL,NAME=MAT
*ELASTIC
 30.E6,.3
*DENSITY
 1.0,
*BOUNDARY
 EDGE1,YSYMM
 EDGE2,YSYMM
 BASE,ENCASTRE
 TOP,ENCASTRE
**
*NSET, NSET=QA_TEST_ALLNODES
QA_TEST_ALLNODES, BASE, TOP, NALL
EDGE1, EDGE2
**
*STEP
*DYNAMIC,EXPLICIT
 ,0.001
*OUTPUT, FIELD, NUMBER INTERVAL=2
*NODE OUTPUT, NSET=QA_TEST_ALLNODES
 COORD,
*OUTPUT,FIELD,VARIABLE=PRESELECT
*OUTPUT,HISTORY,VARIABLE=PRESELECT,TIMEINT=0.0005
***OUTPUT,HISTORY,VARIABLE=PRESELECT
*END STEP