*Heading
** Job name: Job-1 Model name: Model-1
**
** PARTS
**
*Dsa controls, form=total
*Parameter
shape=0.0
mu=0.2
*Design parameter
shape,mu
*Part, name=Part-1
*End Part
*Part, name=Part-2
*End Part
**
** ASSEMBLY
**
*Assembly, name=Assembly
**
*Instance, name=Part-1-1, part=Part-1
*Node
*Parameter shape variation, parameter=shape
*Element, type=CPE4RH, elset=eall
*Solid section, elset=eall, material=Material-1
*End Instance
**
*Instance, name=Part-2-1, part=Part-2
*Node
*Element, type=R2D2
*Nset, nset=ref, internal
*Elset, elset=Part-2-1, generate
*End Instance
*Nset, nset=base, internal, instance=Part-1-1
*Elset, elset=_master_SPOS, internal, instance=Part-2-1, generate
*Surface, type=ELEMENT, name=master, internal
_master_SPOS, SPOS
*Elset, elset=_slave_S4, internal, instance=Part-1-1
*Surface, type=ELEMENT, name=slave, internal
_slave_S4, S4
*Rigid Body, ref node=Part-2-1.ref, elset=Part-2-1.Part-2-1
*End Assembly
**
** MATERIALS
**
*Material, name=Material-1
*Hyperelastic
80.,20., 0.
**
**
** INTERACTION PROPERTIES
**
*Surface Interaction, name=IntProp-1
1.,
*Friction
<mu>
**
** INTERACTIONS
**
** Interaction: Int-1
*Contact Pair, interaction=IntProp-1
slave, master
** ----------------------------------------------------------------
**
** STEP: Step-1
**
*Amplitude, name=step
0.0,0.75,1.0,1.0
*Step, nlgeom, unsymm=yes, dsa
Step-1
*Static
0.2, 1., 1e-05, 1.
**
** BOUNDARY CONDITIONS
**
** Name: BC-1 Type: Displacement/Rotation
*Boundary
base, 1, 1
base, 2, 2
** Name: BC-2 Type: Displacement/Rotation
*Boundary
Part-2-1.ref, 1, 1, 2.
Part-2-1.ref, 3, 6
*Boundary, amp=step
Part-2-1.ref, 2, 2, -0.4
**
** OUTPUT REQUESTS
**
*Design response,freq=6
*Node response
U
*Element response
S
*Contact response
Cstress
*Output,field, freq=6
*Node output
U
*Element output
S
*Contact output
Cstress
*End Step