*Heading
** Job name: Job-1 Model name: Model-1
**
** PARTS
**
*Dsa controls, form=total
*Parameter
shape=0.0
mu=0.2
*Design parameter
shape,mu
*Part, name=Part-1
*End Part
*Part, name=Part-2
*End Part
**
** ASSEMBLY
**
*Assembly, name=Assembly
**
*Instance, name=Part-1-1, part=Part-1
*Node
*Parameter shape variation, parameter=shape
*Element, type=CPE4RH, elset=eall
*Solid section, elset=eall, material=Material-1
*End Instance
**
*Instance, name=Part-2-1, part=Part-2
*Node
*Nset, nset=Part-2-1-RefPt_, internal
*Surface, type=SEGMENTS, name=master, internal
START,           1.,          1.2
CIRCL,          -1.,          1.2,           0.,          2.2
*Rigid Body, ref node=Part-2-1-RefPt_, analytical surface=master
*End Instance
*Nset, nset=base, internal, instance=Part-1-1, generate
*Elset, elset=base, internal, instance=Part-1-1
*Nset, nset=ref, internal, instance=Part-2-1
*Elset, elset=slave, internal, instance=Part-1-1
*Surface, type=ELEMENT, name=slave, internal
slave, S3
*End Assembly
**
** MATERIALS
**
*Material, name=Material-1
*Hyperelastic
80.,20., 0.
**
** INTERACTION PROPERTIES
**
*Surface Interaction, name=IntProp-1
1.,
*Friction
<mu>
**
** INTERACTIONS
**
** Interaction: Int-1
*Contact Pair, interaction=IntProp-1
slave,Part-2-1.master
** ----------------------------------------------------------------
**
** STEP: Step-1
**
*Amplitude, name=step
0.0,1.0,1.0,1.0
*Step, nlgeom, dsa
Step-1
*Static
0.2, 1., 1e-05, 1.
**
** BOUNDARY CONDITIONS
**
** Name: BC-1 Type: Displacement/Rotation
*Boundary
base, 1, 1
base, 2, 2
** Name: BC-2 Type: Displacement/Rotation
*Boundary
ref, 1, 1, 2.
ref, 3, 6
*Boundary, amp=step
ref, 2, 2, -0.2
**
** LOADS
**
** Name: Load-1   Type: Concentrated force
**
** OUTPUT REQUESTS
**
*Output, field, freq=4
*Node output
U
*Element output
S
*Design Response
*Node Response
U
*Element Response
S
*Contact Response
Cstress
*El Print, freq=999999
*Node Print, freq=999999
*End Step