*Heading
CANTILEVER BEAM IN A FULLY DEVELOPED LAMINAR FLOW UNIFORM CROSS-SECTION CHANNEL
*Preprint, echo=NO, model=NO, history=NO, contact=NO
**
** PARTS
**
*Part, name=Part-2
*End Part
**
**
** ASSEMBLY
**
*Assembly, name=Assembly
**
*Instance, name=Part-2-1, part=Part-2
*Node
*Element, type=CPS4I
** Region: (Section-1:Picked)
*Elset, elset=_PickedSet2, internal, generate
** Section: Section-1
*Solid Section, elset=_PickedSet2, material=steel
1.,
*End Instance
**
*Nset, nset=end, instance=Part-2-1, generate
*Elset, elset=end, instance=Part-2-1, generate
*Nset, nset=tip, instance=Part-2-1
*Nset, nset=one, instance=Part-2-1
*Elset, elset=_Cant_t_S4, internal, instance=Part-2-1, generate
*Surface, type=ELEMENT, name=Cant_t
_Cant_t_S4, S4
*Elset, elset=_Cant_b_S2, internal, instance=Part-2-1, generate
*Surface, type=ELEMENT, name=Cant_b
_Cant_b_S2, S2
*NSET,NSET=NOUT, instance=Part-2-1
*End Assembly
**
** MATERIALS
**
*Material, name=steel
*Elastic
 1e+9, 0.3
** ----------------------------------------------------------------
**
** STEP:** STEP: TWO-WAY COUPLING - GET PRESSURES SEND POSITIONS
**
*Step, name=Step-1
*Static
0.13333,5., , 0.13333
**
** BOUNDARY CONDITIONS
**
** Name: BC-1 Type: Displacement/Rotation
*Boundary
end, 1, 1
end, 6, 6
** Name: BC-2 Type: Displacement/Rotation
*Boundary
one, 2, 2
**
** COSIMULATION DEFINITION
**
*co-simulation, NAME=cosimulation_name, PROGRAM=MpCCI
*Co-simulation region, import
Cant_t,cf
Cant_b,cf
*Co-simulation region, export
Cant_t,coord
Cant_b,coord
**
** OUTPUT REQUESTS
**
** FIELD OUTPUT: F-Output-1
**
*Output, field
*node output
 U,
 CF,
 COORD
*Output, History
*Node output, NSET=NOUT
 CF,
*End Step