*HEADING
  - HYPERELASTICITY (POLYNOMIAL), FRQ DOMAIN VISCOELASTICITY
*PREPRINT,MODEL=YES
*NODE,NSET=ALL
**
*NSET,NSET=FACE1
*NSET,NSET=FACE2
*NSET,NSET=FACE3
*NSET,NSET=FACE4
*NSET,NSET=FACE5
*NSET,NSET=FACE6
*ELEMENT,TYPE=C3D8R,ELSET=REF
*ELEMENT,TYPE=C3D8R,ELSET=TEST
*SOLID SECTION,ELSET=REF,MATERIAL=POLY1
*MATERIAL,NAME=POLY1
*DENSITY
8.E-7,
*HYPERELASTIC,VAN DER WAALS,MODULI=LONG TERM
200., 10., 0.1, 0.5, 0.001
*VISCOELASTIC,FREQUENCY=TABULAR
1.161E-2,-3.21E-2,,,1.
1.775E-3,-5.116E-3,,,100.0
*SOLID SECTION,ELSET=TEST,MATERIAL=POLY2
*MATERIAL,NAME=POLY2
*DENSITY
8.E-7,
*HYPERELASTIC,VAN DER WAALS,MODULI=LONG TERM
200., 10., 0.1, 0.5, 0.001
*VISCOELASTIC,FREQUENCY=TABULAR,PRELOAD=UNIAXIAL
6.51033875,598.66639979,1.,0.
0.997069,583.5195,100.,0.
4.609767219,423.8969736,1.,0.25
0.705992699,413.1719271,100.,0.25
3.510691353,322.8300626,1.,0.75
0.537667597,314.662117,100.,0.75
3.301996839,303.6392948,1.,2.
0.505705722,295.9568961,100.,2.
*STEP,PERTURBATION
*STEADY STATE DYNAMICS,DIRECT
1.
*BOUNDARY,OP=NEW
FACE1,3
FACE3,2
FACE6,1
FACE4,1,1,0.1
*EL PRINT
S,
E,
*OUTPUT,FIELD
*ELEMENT OUTPUT
S,NE
*END STEP
*STEP,PERTURBATION
*STEADY STATE DYNAMICS,DIRECT
100.
*BOUNDARY,OP=NEW
FACE1,3
FACE3,2
FACE6,1
FACE4,1,1,0.1
*EL PRINT
S,
E,
*OUTPUT,FIELD
*ELEMENT OUTPUT
S,NE
*END STEP
*STEP,NLGEOM,INC=20
UNIAXIAL TENSION
*STATIC,DIRECT
1.,20.
*BOUNDARY,OP=NEW
FACE1,3
FACE3,2
FACE6,1
FACE4,1,1,0.25
*EL PRINT,F=10
S,
NE,
*NODE PRINT,F=10
U,RF
*OUTPUT,FIELD
*ELEMENT OUTPUT
S,NE
*END STEP
*STEP,PERTURBATION
*STEADY STATE DYNAMICS,DIRECT
1.
*BOUNDARY,OP=NEW
FACE1,3
FACE3,2
FACE6,1
FACE4,1,1,0.1
*EL PRINT
S,
E,
*OUTPUT,FIELD
*ELEMENT OUTPUT
S,NE
*END STEP
*STEP,PERTURBATION
*STEADY STATE DYNAMICS,DIRECT
100.
*BOUNDARY,OP=NEW
FACE1,3
FACE3,2
FACE6,1
FACE4,1,1,0.1
*EL PRINT
S,
E,
*OUTPUT,FIELD
*ELEMENT OUTPUT
S,NE
*END STEP
*STEP,NLGEOM,INC=20
UNIAXIAL TENSION
*STATIC,DIRECT
1.,20.
*BOUNDARY,OP=NEW
FACE1,3
FACE3,2
FACE6,1
FACE4,1,1,0.75
*EL PRINT,F=10
S,
NE,
*NODE PRINT,F=10
U,RF
*OUTPUT,FIELD
*ELEMENT OUTPUT
S,NE
*END STEP
*STEP,PERTURBATION
*STEADY STATE DYNAMICS,DIRECT
1.
*BOUNDARY,OP=NEW
FACE1,3
FACE3,2
FACE6,1
FACE4,1,1,0.1
*EL PRINT
S,
E,
*OUTPUT,FIELD
*ELEMENT OUTPUT
S,NE
*END STEP
*STEP,PERTURBATION
*STEADY STATE DYNAMICS,DIRECT
100.
*BOUNDARY,OP=NEW
FACE1,3
FACE3,2
FACE6,1
FACE4,1,1,0.1
*EL PRINT
S,
E,
*OUTPUT,FIELD
*ELEMENT OUTPUT
S,NE
*END STEP
*STEP,NLGEOM,INC=20
UNIAXIAL TENSION
*STATIC,DIRECT
1.,20.
*BOUNDARY,OP=NEW
FACE1,3
FACE3,2
FACE6,1
FACE4,1,1,2.0
*EL PRINT,F=10
S,
NE,
*NODE PRINT,F=10
U,RF
*OUTPUT,FIELD
*ELEMENT OUTPUT
S,NE
*END STEP
*STEP,PERTURBATION
*STEADY STATE DYNAMICS,DIRECT
1.
*BOUNDARY,OP=NEW
FACE1,3
FACE3,2
FACE6,1
FACE4,1,1,0.1
*EL PRINT
S,
E,
*OUTPUT,FIELD
*ELEMENT OUTPUT
S,NE
*END STEP
*STEP,PERTURBATION
*STEADY STATE DYNAMICS,DIRECT
100.
*BOUNDARY,OP=NEW
FACE1,3
FACE3,2
FACE6,1
FACE4,1,1,0.1
*EL PRINT
S,
E,
*OUTPUT,FIELD
*ELEMENT OUTPUT
S,NE
*END STEP