*HEADING
  - HYPERELASTICITY (POLYNOMIAL), FRQ DOMAIN VISCOELASTICITY
*PREPRINT,MODEL=YES
*NODE,NSET=ALL
**
*NSET,NSET=FACE1
*NSET,NSET=FACE2
*NSET,NSET=FACE3
*NSET,NSET=FACE4
*NSET,NSET=FACE5
*NSET,NSET=FACE6
*ELEMENT,TYPE=C3D8R,ELSET=REF
*ELEMENT,TYPE=C3D8R,ELSET=TEST
*SOLID SECTION,ELSET=REF,MATERIAL=POLY1
*MATERIAL,NAME=POLY1
*DENSITY
8.E-7,
*HYPERELASTIC,OGDEN,N=3,MODULI=LONG TERM
160.,2.,40.,-2.,20.,-1.,0.001,
*VISCOELASTIC,FREQUENCY=TABULAR
1.161E-2,-3.21E-2,,,1.
1.775E-3,-5.116E-3,,,100.0
*SOLID SECTION,ELSET=TEST,MATERIAL=POLY2
*MATERIAL,NAME=POLY2
*DENSITY
8.E-7,
*HYPERELASTIC,OGDEN,N=3,MODULI=LONG TERM
160.,2.,40.,-2.,20.,-1.,0.001,
*VISCOELASTIC,FREQUENCY=TABULAR,PRELOAD=UNIAXIAL
7.1139728493,656.35032548,1.,0.
1.0896997823,639.797376332,100.,0.
5.405312988,498.7057524,1.,0.25
0.827971783,486.1285499,100.,0.25
4.28286891,395.146658,1.,0.75
0.656038719,385.1811833,100.,0.75
3.724890984,343.6664195,1.,2.
0.570569112,334.9992602,100.,2.
*STEP,PERTURBATION
*STEADY STATE DYNAMICS,DIRECT
1.
*BOUNDARY,OP=NEW
FACE1,3
FACE3,2
FACE6,1
FACE4,1,1,0.1
*EL PRINT
S,
E,
*OUTPUT,FIELD
*ELEMENT OUTPUT
S,NE
*END STEP
*STEP,PERTURBATION
*STEADY STATE DYNAMICS,DIRECT
100.
*BOUNDARY,OP=NEW
FACE1,3
FACE3,2
FACE6,1
FACE4,1,1,0.1
*EL PRINT
S,
E,
*OUTPUT,FIELD
*ELEMENT OUTPUT
S,NE
*END STEP
*STEP,NLGEOM,INC=20
UNIAXIAL TENSION
*STATIC,DIRECT
1.,20.
*BOUNDARY,OP=NEW
FACE1,3
FACE3,2
FACE6,1
FACE4,1,1,0.25
*EL PRINT,F=10
S,
NE,
*NODE PRINT,F=10
U,RF
*OUTPUT,FIELD
*ELEMENT OUTPUT
S,NE
*END STEP
*STEP,PERTURBATION
*STEADY STATE DYNAMICS,DIRECT
1.
*BOUNDARY,OP=NEW
FACE1,3
FACE3,2
FACE6,1
FACE4,1,1,0.1
*EL PRINT
S,
E,
*OUTPUT,FIELD
*ELEMENT OUTPUT
S,NE
*END STEP
*STEP,PERTURBATION
*STEADY STATE DYNAMICS,DIRECT
100.
*BOUNDARY,OP=NEW
FACE1,3
FACE3,2
FACE6,1
FACE4,1,1,0.1
*EL PRINT
S,
E,
*OUTPUT,FIELD
*ELEMENT OUTPUT
S,NE
*END STEP
*STEP,NLGEOM,INC=20
UNIAXIAL TENSION
*STATIC,DIRECT
1.,20.
*BOUNDARY,OP=NEW
FACE1,3
FACE3,2
FACE6,1
FACE4,1,1,0.75
*EL PRINT,F=10
S,
NE,
*NODE PRINT,F=10
U,RF
*OUTPUT,FIELD
*ELEMENT OUTPUT
S,NE
*END STEP
*STEP,PERTURBATION
*STEADY STATE DYNAMICS,DIRECT
1.
*BOUNDARY,OP=NEW
FACE1,3
FACE3,2
FACE6,1
FACE4,1,1,0.1
*EL PRINT
S,
E,
*OUTPUT,FIELD
*ELEMENT OUTPUT
S,NE
*END STEP
*STEP,PERTURBATION
*STEADY STATE DYNAMICS,DIRECT
100.
*BOUNDARY,OP=NEW
FACE1,3
FACE3,2
FACE6,1
FACE4,1,1,0.1
*EL PRINT
S,
E,
*OUTPUT,FIELD
*ELEMENT OUTPUT
S,NE
*END STEP
*STEP,NLGEOM,INC=20
UNIAXIAL TENSION
*STATIC,DIRECT
1.,20.
*BOUNDARY,OP=NEW
FACE1,3
FACE3,2
FACE6,1
FACE4,1,1,2.0
*EL PRINT,F=10
S,
NE,
*NODE PRINT,F=10
U,RF
*OUTPUT,FIELD
*ELEMENT OUTPUT
S,NE
*END STEP
*STEP,PERTURBATION
*STEADY STATE DYNAMICS,DIRECT
1.
*BOUNDARY,OP=NEW
FACE1,3
FACE3,2
FACE6,1
FACE4,1,1,0.1
*EL PRINT
S,
E,
*OUTPUT,FIELD
*ELEMENT OUTPUT
S,NE
*END STEP
*STEP,PERTURBATION
*STEADY STATE DYNAMICS,DIRECT
100.
*BOUNDARY,OP=NEW
FACE1,3
FACE3,2
FACE6,1
FACE4,1,1,0.1
*EL PRINT
S,
E,
*OUTPUT,FIELD
*ELEMENT OUTPUT
S,NE
*END STEP