*HEADING
  - HYPERELASTICITY (POLYNOMIAL), FRQ DOMAIN VISCOELASTICITY
**PREPRINT,MODEL=YES
*NODE,NSET=ALL
*NSET,NSET=FACE1
*NSET,NSET=FACE2
*NSET,NSET=FACE3
*NSET,NSET=FACE4
*NSET,NSET=FACE5
*NSET,NSET=FACE6
*ELEMENT,TYPE=C3D8RH,ELSET=TEST
*SOLID SECTION,ELSET=TEST,MATERIAL=POLY2
*MATERIAL,NAME=POLY2
*DENSITY
8.E-7,
*HYPERELASTIC,N=1,MODULI=LONG TERM
80.,20.
*VISCOELASTIC,FREQUENCY=TABULAR,PRELOAD=UNIAXIAL
6.,630.,1.,0.
3.,615.,100.,0.
5.,500.,1.,0.25
3.,300.,100.,0.25
*STEP,NLGEOM,INC=20
UNIAXIAL TENSION
*STATIC,DIRECT
1.,20.
*BOUNDARY,OP=NEW
FACE1,3
FACE3,2
FACE6,1
FACE4,1,1,0.125
*EL PRINT,F=10
S,
NE,
*NODE PRINT,F=10
U,RF
*OUTPUT,FIELD
*ELEMENT OUTPUT
S,NE
*END STEP
*STEP,PERTURBATION
*STEADY STATE DYNAMICS,DIRECT
50.5
*BOUNDARY,OP=NEW
FACE1,3
FACE3,2
FACE6,1
FACE4,1,1,0.1
*EL PRINT
S,
E,
*OUTPUT,FIELD
*ELEMENT OUTPUT
S,NE
*END STEP