*Heading
** Job name: Job-1 Model name: Model-1
*Preprint, echo=NO, model=NO, history=NO, contact=NO
**
** PARTS
**
*Part, name=Part-1
*Node
*Element, type=C3D8
*Node
*Nset, nset=Part-1-RefPt_, internal
*Nset, nset=_PickedSet6, internal, generate
*Elset, elset=_PickedSet6, internal, generate
*Elset, elset=_Surf-1_S4, internal
*Elset, elset=_Surf-1_S6, internal
*Surface, type=ELEMENT, name=Surf-1
_Surf-1_S4, S4
_Surf-1_S6, S6
*Elset, elset=_Surf-2_S4, internal
*Elset, elset=_Surf-2_S6, internal
*Surface, type=ELEMENT, name=Surf-2
_Surf-2_S4, S4
_Surf-2_S6, S6
** Region: (Section-1:Picked)
*Elset, elset=_PickedSet6, internal, generate
** Section: Section-1
*Solid Section, elset=_PickedSet6, material=Material-1
1.,
*End Part
**
*Part, name=Part-2
*Node
*Element, type=C3D8
*Nset, nset=_PickedSet5, internal, generate
*Elset, elset=_PickedSet5, internal, generate
*Elset, elset=_Surf-1_S4, internal
*Elset, elset=_Surf-1_S6, internal
*Surface, type=ELEMENT, name=Surf-1
_Surf-1_S4, S4
_Surf-1_S6, S6
*Elset, elset=_Surf-2_S4, internal
*Elset, elset=_Surf-2_S6, internal
*Surface, type=ELEMENT, name=Surf-2
_Surf-2_S4, S4
_Surf-2_S6, S6
** Region: (Section-1:Picked)
*Elset, elset=_PickedSet5, internal, generate
** Section: Section-1
*Solid Section, elset=_PickedSet5, material=Material-1
1.,
*End Part
**
*Part, name=Part-3
*Node
*Element, type=C3D8
*Node
*Nset, nset=Part-3-RefPt_, internal
*Nset, nset=_PickedSet6, internal, generate
*Elset, elset=_PickedSet6, internal, generate
*Elset, elset=_Surf-1_S4, internal
*Elset, elset=_Surf-1_S6, internal
*Surface, type=ELEMENT, name=Surf-1
_Surf-1_S4, S4
_Surf-1_S6, S6
*Elset, elset=_Surf-2_S4, internal
*Elset, elset=_Surf-2_S6, internal
*Surface, type=ELEMENT, name=Surf-2
_Surf-2_S4, S4
_Surf-2_S6, S6
** Region: (Section-1:Picked)
*Elset, elset=_PickedSet6, internal, generate
** Section: Section-1
*Solid Section, elset=_PickedSet6, material=Material-1
1.,
*End Part
**
*Part, name=Part-4
*Node
*Element, type=C3D8
*Nset, nset=_PickedSet6, internal, generate
*Elset, elset=_PickedSet6, internal, generate
*Elset, elset=_Surf-1_S4, internal
*Elset, elset=_Surf-1_S6, internal
*Surface, type=ELEMENT, name=Surf-1
_Surf-1_S4, S4
_Surf-1_S6, S6
*Elset, elset=_Surf-2_S4, internal
*Elset, elset=_Surf-2_S6, internal
*Surface, type=ELEMENT, name=Surf-2
_Surf-2_S4, S4
_Surf-2_S6, S6
** Region: (Section-2:Picked)
*Elset, elset=_PickedSet6, internal, generate
** Section: Section-2
*Solid Section, elset=_PickedSet6, material=Material-2
1.,
*End Part
**
*Part, name=Part-5
*Node
*Element, type=C3D8
*Nset, nset=_PickedSet6, internal, generate
*Elset, elset=_PickedSet6, internal, generate
*Elset, elset=_Surf-1_S4, internal
*Elset, elset=_Surf-1_S6, internal
*Surface, type=ELEMENT, name=Surf-1
_Surf-1_S4, S4
_Surf-1_S6, S6
*Elset, elset=_Surf-2_S4, internal
*Elset, elset=_Surf-2_S6, internal
*Surface, type=ELEMENT, name=Surf-2
_Surf-2_S4, S4
_Surf-2_S6, S6
** Region: (Section-2:Picked)
*Elset, elset=_PickedSet6, internal, generate
** Section: Section-2
*Solid Section, elset=_PickedSet6, material=Material-2
1.,
*End Part
**
**
** ASSEMBLY
**
*Assembly, name=Assembly
**
*Instance, name=Part-1-1, part=Part-1
*End Instance
**
*Instance, name=Part-2-1, part=Part-2
*End Instance
**
*Instance, name=Part-3-1, part=Part-3
*End Instance
**
*Instance, name=Part-4-1, part=Part-4
*End Instance
**
*Instance, name=Part-5-1, part=Part-5
*End Instance
**
*Nset, nset=_PickedSet12, internal, instance=Part-1-1
*Nset, nset=_PickedSet13, internal, instance=Part-3-1
*Nset, nset=_PickedSet14, internal, instance=Part-3-1
*Orientation, name="Datum csys-1"
*Orientation, name="Datum csys-2"
** Constraint: Constraint-1
*Tie, name=Constraint-1, adjust=yes
Part-4-1.Surf-1, Part-1-1.Surf-2
** Constraint: Constraint-2
*Tie, name=Constraint-2, adjust=yes
Part-4-1.Surf-2, Part-2-1.Surf-1
** Constraint: Constraint-3
*Tie, name=Constraint-3, adjust=yes
Part-5-1.Surf-2, Part-3-1.Surf-1
** Constraint: Constraint-4
*Coupling, constraint name=Constraint-4, ref node=_PickedSet12, surface=Part-1-1.Surf-1
*Distributing, weighting method=UNIFORM
** Constraint: Constraint-5
*Coupling, constraint name=Constraint-5, ref node=_PickedSet13, surface=Part-3-1.Surf-2
*Distributing, weighting method=UNIFORM
** Constraint: Constraint-6
*Tie, name=Constraint-6, adjust=yes
Part-5-1.Surf-1, Part-2-1.Surf-2
**
** CONNECTORS
**
*Element, type=CONN3D2, elset=_Conn-1_CnSet_
1, Part-3-1.2647, Part-1-1.793
*Connector Section, elset=_Conn-1_CnSet_
Bushing,
"Datum csys-1", "Datum csys-2"
*Elset, elset=_BC-2_CnSet_, internal
_Conn-1_CnSet_,
*End Assembly
**
** MATERIALS
**
*Material, name=Material-1
*Elastic
210000., 0.3
*Material, name=Material-2
*HYPERELASTIC,N=2,OGDEN
0.167099, 9.00665, 2.153721E-05, -4.86940,0.1,0.1
** ----------------------------------------------------------------
**
** STEP: Step-1
**
*Step, name=Step-1, nlgeom=YES
*Static
0.01, 1., 1e-05, 1.
**
** BOUNDARY CONDITIONS
**
** Name: BC-1 Type: Displacement/Rotation
*Boundary
_PickedSet14, 1, 1
_PickedSet14, 2, 2
_PickedSet14, 3, 3
_PickedSet14, 4, 4
_PickedSet14, 5, 5
_PickedSet14, 6, 6
** Name: BC-2 Type: Connector displacement
** Applies To: Conn-1
*Connector Motion
_BC-2_CnSet_, 1,-5.0
_BC-2_CnSet_, 2
_BC-2_CnSet_, 3
_BC-2_CnSet_, 4
_BC-2_CnSet_, 5
_BC-2_CnSet_, 6
**
** OUTPUT REQUESTS
**
*Restart, write, frequency=0
**
** FIELD OUTPUT: F-Output-1
**
*Output, field, frequency=99999
*Node Output
U,
**
** HISTORY OUTPUT: H-Output-2
**
*Output, history
*Element Output, elset=_Conn-1_CnSet_
CRF1, CRF2, CRF3, CRM1, CRM2, CRM3, CU1, CU2, CU3, CUR1, CUR2, CUR3
**
** HISTORY OUTPUT: H-Output-1
**
*Output, history, variable=PRESELECT
*End Step