*Heading
** Job name: fastener_s8r_c3d20r_std Model name: Model-1
**
** PARTS
**
*Part, name=Part-4
*End Part
**
** ASSEMBLY
**
*Assembly, name=Assembly
**
*Instance, name=Part-4-1, part=Part-4
*Node
*Element, type=C3D20R
*Element, type=S8R
** Region: (Section-1:Picked)
*Elset, elset=_I1, internal, generate
** Section: Section-1
*Solid Section, elset=_I1, material=Material-1
1.,
** Region: (Section-2:Picked)
*Elset, elset=_I2, internal, generate
** Section: Section-2
*Shell Section, elset=_I2, material=Material-1
0.02, 5
*End Instance
**
*Instance, name=Part-4-2, part=Part-4
*Node
*Element, type=C3D20R
*Element, type=S8R
** Region: (Section-1:Picked)
*Elset, elset=_I1, internal, generate
** Section: Section-1
*Solid Section, elset=_I1, material=Material-1
1.,
** Region: (Section-2:Picked)
*Elset, elset=_I2, internal, generate
** Section: Section-2
*Shell Section, elset=_I2, material=Material-1
0.02, 5
*End Instance
**
*Instance, name=Part-4-3, part=Part-4
*Node
*Element, type=C3D20R
*Element, type=S8R
** Region: (Section-1:Picked)
*Elset, elset=_I1, internal, generate
** Section: Section-1
*Solid Section, elset=_I1, material=Material-1
1.,
** Region: (Section-2:Picked)
*Elset, elset=_I2, internal, generate
** Section: Section-2
*Shell Section, elset=_I2, material=Material-1
0.02, 5
*End Instance
**
*Instance, name=Part-4-4, part=Part-4
*Node
*Element, type=C3D20R
*Element, type=S8R
** Region: (Section-1:Picked)
*Elset, elset=_I1, internal, generate
** Section: Section-1
*Solid Section, elset=_I1, material=Material-1
1.,
** Region: (Section-2:Picked)
*Elset, elset=_I2, internal, generate
** Section: Section-2
*Shell Section, elset=_I2, material=Material-1
0.02, 5
*End Instance
*Nset, nset=ShellCorner1, instance=Part-4-1, generate
*Nset, nset=ShellCorner2, instance=Part-4-2, generate
*Nset, nset=ShellCorner3, instance=Part-4-3, generate
*Nset, nset=ShellCorner4, instance=Part-4-4, generate
*Nset, nset=_PickedSet30, internal, instance=Part-4-1
*Nset, nset=_PickedSet30, internal, instance=Part-4-2
*Nset, nset=_PickedSet30, internal, instance=Part-4-3
*Nset, nset=_PickedSet30, internal, instance=Part-4-4
*Elset, elset=_PickedSet30, internal, instance=Part-4-1
*Elset, elset=_PickedSet30, internal, instance=Part-4-2
*Elset, elset=_PickedSet30, internal, instance=Part-4-3, generate
*Elset, elset=_PickedSet30, internal, instance=Part-4-4, generate
*Elset, elset=_ShellSurf_SNEG, internal, instance=Part-4-1, generate
*Elset, elset=_ShellSurf_SNEG, internal, instance=Part-4-2, generate
*Elset, elset=_ShellSurf_SNEG, internal, instance=Part-4-3, generate
*Elset, elset=_ShellSurf_SNEG, internal, instance=Part-4-4, generate
*Surface, type=ELEMENT, name=ShellSurf
_ShellSurf_SNEG, SNEG
*Elset, elset=_SolidSurf_S3, internal, instance=Part-4-1
*Elset, elset=_SolidSurf_S3, internal, instance=Part-4-2
*Elset, elset=_SolidSurf_S3, internal, instance=Part-4-3, generate
*Elset, elset=_SolidSurf_S3, internal, instance=Part-4-4, generate
*Surface, type=ELEMENT, name=SolidSurf
_SolidSurf_S3, S3
*Nset, nset=refNode1, instance=Part-4-1
*Nset, nset=refNode2, instance=Part-4-2
*Nset, nset=refNode3, instance=Part-4-3
*Nset, nset=refNode4, instance=Part-4-4
*Nset, nset=kRefNode1, instance=Part-4-1
*Nset, nset=kRefNode2, instance=Part-4-2
*Nset, nset=kRefNode3, instance=Part-4-3
*Nset, nset=kRefNode4, instance=Part-4-4
*Nset, nset=refNode
 refNode1, refNode2, refNode3, refNode4
*Nset, nset=kRefNode
 kRefNode1, kRefNode2, kRefNode3, kRefNode4
*Fastener, interaction name=inter-1, reference node set=refNode, property=prop-1
 ShellSurf, SolidSurf
*Fastener Property, name=prop-1
*Kinematic Coupling, ref node=kRefNode1
 ShellCorner1,1,3
*Kinematic Coupling, ref node=kRefNode2
 ShellCorner2,1,3
*Kinematic Coupling, ref node=kRefNode3
 ShellCorner3,1,3
*Kinematic Coupling, ref node=kRefNode4
 ShellCorner4,1,3
*End Assembly
**
** MATERIALS
**
*Material, name=Material-1
*Elastic
 2e+11, 0.3
** ----------------------------------------------------------------
**
** STEP: Step-1
**
*Step, name=Step-1
Load
*Static
0.25, 1., 1e-05, 1.
**
** BOUNDARY CONDITIONS
**
** Name: BC-1 Type: Displacement/Rotation
*Boundary
_PickedSet30, 1, 3
*Cload
 kRefNode,1,1.e3
 kRefNode,2,1.e3
 kRefNode,3,1.e3
 kRefNode,4,1.e3
 kRefNode,5,1.e3
 kRefNode,6,1.e3
**
** FIELD OUTPUT: F-Output-1
**
*Output, field
*Node Output
U,
*Element Output
S,
**
** HISTORY OUTPUT: H-Output-1
**
*Output, history
*Interaction Output, nset=refNode
 FTF,
*El Print, freq=0
*Node Print, freq=0
*Interaction Print
 FTF,
*End Step