*Heading
** Job name: err_cpeg4h Model name: Model-1
*Preprint, echo=NO, model=NO, history=NO, contact=NO
**
** PARTS
**
*Part, name=Part-1
*Node
*Element, type=CPEG4H
*Node
*Nset, nset=Part-1-RefPt_, internal
*Nset, nset=_PickedSet3, internal, generate
*Elset, elset=_PickedSet3, internal, generate
** Region: (Section-1:Picked)
*Elset, elset=_PickedSet3, internal, generate
** Section: Section-1
*Solid Section, elset=_PickedSet3, material=Material-1, ref node=Part-1-RefPt_
1.,
*End Part
**
**
** ASSEMBLY
**
*Assembly, name=Assembly
**
*Instance, name=Part-1-1, part=Part-1
*End Instance
**
*Nset, nset=_PickedSet5, internal, instance=Part-1-1
*Elset, elset=_PickedSet5, internal, instance=Part-1-1
*Nset, nset=_PickedSet6, internal, instance=Part-1-1
*Nset, nset=_PickedSet8, internal, instance=Part-1-1
*End Assembly
**
** MATERIALS
**
*Material, name=Material-1
*Hyperelastic
80.,20., 0.
** ----------------------------------------------------------------
**
** STEP: Step-1
**
*Step, name=Step-1, nlgeom=YES
*Static
0.1, 1., 1e-05, 1.
**
** BOUNDARY CONDITIONS
**
** Name: BC-1 Type: Displacement/Rotation
*Boundary
_PickedSet5, 1, 1
** Name: BC-2 Type: Displacement/Rotation
*Boundary
_PickedSet6, 2, 2
** Name: BC-3 Type: Displacement/Rotation
*Boundary
_PickedSet8, 1, 1, -7.
**
** OUTPUT REQUESTS
**
*Restart, write, frequency=0
**
** FIELD OUTPUT: F-Output-1
**
*Output, field
*Node Output
U,
*Element Output, directions=YES
ENDENERI, ENDEN, EVOL, LE, MISESERI, MISESAVG, PE, PEEQ, PEMAG, S
*Output, history, frequency=0
*End Step