*Heading
** Job name: err_cpe6h Model name: Model-1
*Preprint, echo=NO, model=NO, history=NO, contact=NO
**
** PARTS
**
*Part, name=Part-1
*Node
*Element, type=CPE6H
*Nset, nset=_PickedSet2, internal, generate
*Elset, elset=_PickedSet2, internal, generate
** Region: (HKS:Picked)
*Elset, elset=_PickedSet2, internal, generate
** Section: HKS
*Solid Section, elset=_PickedSet2, material=HKS
1.,
*End Part
**
**
** ASSEMBLY
**
*Assembly, name=Assembly
**
*Instance, name=Part-1-1, part=Part-1
*End Instance
**
*Nset, nset=_PickedSet4, internal, instance=Part-1-1
*Elset, elset=_PickedSet4, internal, instance=Part-1-1
*Nset, nset=_PickedSet5, internal, instance=Part-1-1
*Elset, elset=_PickedSet5, internal, instance=Part-1-1
*Elset, elset=__PickedSurf6_S1, internal, instance=Part-1-1
*Surface, type=ELEMENT, name=_PickedSurf6, internal
__PickedSurf6_S1, S1
*End Assembly
**
** MATERIALS
**
*Material, name=HKS
*Hyperelastic
80.,20., 0.
**
** BOUNDARY CONDITIONS
**
** Name: BC-1 Type: Displacement/Rotation
*Boundary
_PickedSet4, 1, 1
** Name: BC-2 Type: Displacement/Rotation
*Boundary
_PickedSet5, 2, 2
** ----------------------------------------------------------------
**
** STEP: Step-1
**
*Step, name=Step-1, nlgeom=YES
*Static
0.1, 1., 1e-05, 1.
**
** LOADS
**
** Name: Load-1   Type: Pressure
*Dsload
_PickedSurf6, P, -150.
**
** OUTPUT REQUESTS
**
*Restart, write, frequency=0
**
** FIELD OUTPUT: F-Output-1
**
*Output, field
*Node Output
U,
*Element Output, directions=YES
ENDENERI, ENDEN, LE, MISESERI, MISESAVG, S
**
** HISTORY OUTPUT: H-Output-1
**
*Output, history, variable=PRESELECT
*End Step