*Heading
** Job name: err_cax6m Model name: Model-1
*Preprint, echo=NO, model=NO, history=NO, contact=NO
**
** PARTS
**
*Part, name=Part-1
*Node
*Element, type=CAX6M
*Nset, nset=_PickedSet2, internal, generate
*Elset, elset=_PickedSet2, internal, generate
** Region: (Section-1:Picked)
*Elset, elset=_PickedSet2, internal, generate
** Section: Section-1
*Solid Section, elset=_PickedSet2, material=ABQ
1.,
*End Part
**
**
** ASSEMBLY
**
*Assembly, name=Assembly
**
*Instance, name=Part-1-1, part=Part-1
*End Instance
**
*Nset, nset=_PickedSet8, internal, instance=Part-1-1
*Elset, elset=_PickedSet8, internal, instance=Part-1-1, generate
*Nset, nset=_PickedSet9, internal, instance=Part-1-1
*Elset, elset=_PickedSet9, internal, instance=Part-1-1
*End Assembly
**
** MATERIALS
**
*Material, name=ABQ
*Elastic
10000., 0.3
*Plastic
100.,0.
** ----------------------------------------------------------------
**
** STEP: Step-1
**
*Step, name=Step-1, nlgeom=YES
*Static
0.1, 1., 1e-05, 1.
**
** BOUNDARY CONDITIONS
**
** Name: BC-1 Type: Displacement/Rotation
*Boundary
_PickedSet8, 1, 1
_PickedSet8, 2, 2
** Name: BC-2 Type: Displacement/Rotation
*Boundary
_PickedSet9, 2, 2, -1.
**
** OUTPUT REQUESTS
**
*Restart, write, frequency=0
**
** FIELD OUTPUT: F-Output-1
**
*Output, field
*Node Output
U,
*Element Output, directions=YES
ENDENERI, ENDEN, EVOL, LE, MISESERI, MISESAVG, PE, PEEQ, PEEQERI, PEEQAVG, PEERI, PEMAG, PEAVG, S
**
** HISTORY OUTPUT: H-Output-1
**
*Output, history, variable=PRESELECT
*End Step