*Heading
** Job name: err_c3d10h Model name: Model-1
*Preprint, echo=NO, model=NO, history=NO, contact=NO
**
** PARTS
**
*Part, name=Part-1
*End Part
**
**
** ASSEMBLY
**
*Assembly, name=Assembly
**
*Instance, name=Part-1-1, part=Part-1
*Node
*Element, type=C3D10H
*Nset, nset=_PickedSet4, internal, generate
*Elset, elset=_PickedSet4, internal, generate
*Nset, nset=_PickedSet5, internal, generate
*Elset, elset=_PickedSet5, internal, generate
** Region: (S2:Picked)
*Elset, elset=_PickedSet5, internal, generate
** Section: S2
*Solid Section, elset=_PickedSet5, material=HKS2
1.,
*End Instance
**
*Nset, nset=_PickedSet4, internal, instance=Part-1-1
*Elset, elset=_PickedSet4, internal, instance=Part-1-1
*Nset, nset=_PickedSet5, internal, instance=Part-1-1
*Elset, elset=_PickedSet5, internal, instance=Part-1-1
*Nset, nset=_PickedSet6, internal, instance=Part-1-1
*Elset, elset=_PickedSet6, internal, instance=Part-1-1
*Nset, nset=_PickedSet32, internal, instance=Part-1-1, generate
*Elset, elset=_PickedSet32, internal, instance=Part-1-1, generate
*End Assembly
**
** MATERIALS
**
*Material, name=HKS2
*Conductivity
2.,
*Density
 0.5,
*Expansion
 0.1,
*Hyperelastic
80.,20., 0.
*Specific Heat
3.,
** ----------------------------------------------------------------
**
** STEP: Step-1
**
*Step, name=Step-1, nlgeom=YES
*Static
0.1, 1., 1e-05, 1.
**
** BOUNDARY CONDITIONS
**
** Name: BC-1 Type: Displacement/Rotation
*Boundary
_PickedSet4, 3, 3
** Name: BC-2 Type: Displacement/Rotation
*Boundary
_PickedSet5, 1, 1
** Name: BC-3 Type: Displacement/Rotation
*Boundary
_PickedSet6, 2, 2
**
** LOADS
**
** Name: Load-1   Type: Body force
*Dload
_PickedSet32, BZ, 5.
**
** OUTPUT REQUESTS
**
*Restart, write, frequency=0
**
** FIELD OUTPUT: F-Output-1
**
*Output, field
*Node Output
NT, U
*Element Output, directions=YES
ENDENERI, ENDEN, EVOL, LE, MISESERI, MISESAVG, PE, PEEQ, PEMAG, S
**
** HISTORY OUTPUT: H-Output-1
**
*Output, history, variable=PRESELECT
*End Step